program: Orca
programVersion: 5.0.3
elementType: C H C H C C C H H C H H C C H H H H H H H
charge: 1
multiplicity: 1
keywords: DSD-PBEP86 cc-pVTZ EnGrad D3BJ RIJCOSX verytightscf cc-pVTZ/C def2/J soscf
formula: C8H13
InChI: InChI=1/C8H13/c1-2-4-6-8-7-5-3-1/h1-2,7H,3-6,8H2
21 atoms
C  -1.999505 0.521185 0.113332
H  -2.182929 0.728382 1.170986
C  -1.984345 -1.008092 -0.161191
H  -2.679588 -1.602931 0.432279
C  -0.535619 -1.096274 0.27446
C  0.598386 -1.090107 -0.514615
C  1.904013 -0.638622 0.055082
H  1.997855 -0.956729 1.098841
H  2.747051 -1.045485 -0.509467
C  1.918473 0.928281 -0.018234
H  2.077538 1.239058 -1.057198
H  2.755255 1.317376 0.567697
C  0.568012 1.476978 0.482474
C  -0.518642 0.744065 -0.249381
H  0.518562 -1.283964 -1.583688
H  -2.115776 -1.23619 -1.222679
H  0.456175 1.382488 1.56782
H  -0.407119 0.821457 -1.334242
H  -2.682661 1.114409 -0.501041
H  0.488028 2.545838 0.236148
H  -0.380201 -1.049322 1.353155
totalener: -311.15375251 hartree
nucrepener: 386.92525414 hartree
electener: -698.07900665 hartree
oneelecener: -1174.03791842 hartree
twoeener: 475.95891177 hartree
kineticenergy: 309.75533644 hartree
exchangeener: -13.674626506785 hartree
correlationener: -0.927620635265 hartree
xcener: -14.602247142050 hartree
chargesum: 1.0000000
charge: -0.211429 0.167040 -0.239986 0.184211 -0.049489 -0.043057 -0.250734 0.164613 0.183421 -0.248599 0.161378 0.181167 -0.234141 -0.087956 0.225286 0.168233 0.160445 0.195224 0.182251 0.192401 0.199719
charge: 0.105207 -0.000516 0.107455 -0.001092 0.120846 0.182476 0.085544 0.002216 0.006839 0.097546 -0.006349 -0.000081 0.066226 0.197823 0.005247 -0.000642 -0.002842 0.003342 -0.001425 0.018211 0.013968
qa: -0.2114 0.1670 -0.2400 0.1842 -0.0495 -0.0431 -0.2507 0.1646 0.1834 -0.2486 0.1614 0.1812 -0.2341 -0.0880 0.2253 0.1682 0.1604 0.1952 0.1823 0.1924 0.1997
va: 3.8656 0.9866 3.8873 0.9771 3.7928 3.7695 3.9213 0.9835 0.9764 3.8938 0.9812 0.9733 3.8946 3.7639 0.9596 0.9860 0.9849 0.9811 0.9749 0.9687 0.9784
dispcorr: -0.011478594 hartree
energy: -311.859299085131
dipole: 0.55495 -0.68413 -0.12919 1.84815 -1.90438 -0.05623 0.20473 -0.37289 -0.16816
magnitude: 0.21938 au
magnitude: 0.55763 debye
