program: Gaussian 09
title: 000051170
version: EM64L-G09RevD.01
frameworkgroup: C1[X(C13H11NO)]
method: RPBEPBE
basis: SDD
operation: Freq
keyword: #p
keyword: freq=noraman
keyword: PBEPBE/SDD
title: #p freq=noraman PBEPBE/SDD
converged: YES YES NO NO
title: Mulliken charges:
elementType: O N C C C C C C C C C C C C C H H H H H H H H H H H
charge: -0.224374 -0.004406 0.218784 0.319831 0.266716 -0.381255 -0.372616 -0.373336 -0.353823 -0.828705 -0.247456 -0.233562 -0.299264 -0.325915 0.137386 0.250750 0.256837 0.248674 0.233260 0.234915 0.247378 0.231548 0.233516 0.232779 0.272673 0.259665
chargesum: 0.00000
title: Mulliken charges with hydrogens summed into heavy atoms:
elementType: O N C C C C C C C C C C C C C
charge: -0.224374 -0.004406 0.218784 0.319831 0.266716 -0.130504 -0.139356 -0.116500 -0.105149 -0.114865 -0.013939 -0.000783 -0.026591 -0.066250 0.137386
polarizability: 2.85111320e+02 1.01765859e+00 1.40942192e+02 -3.27482257e+00 6.85441973e+00 7.78622701e+01
1716.lowfreq: -5.6263 -1.9239 -0.0007 -0.0001 0.0005 4.8555 51.7694 64.2283 90.2744
frequency: 51.7563 64.1993 90.2734 128.8027 171.0589 177.7247 220.8642 226.0402 263.2897 328.3579 339.8062 411.7274 420.1301 459.6703 479.3713 511.9405 549.9182 560.3264 617.9757 643.4695 697.9345 726.4779 742.1398 769.5229 794.3992 815.1961 852.0657 856.5767 878.6317 954.4847 981.0978 988.1370 991.1904 991.7460 994.6160 1006.6676 1043.6790 1054.0509 1103.3422 1113.3650 1124.4247 1178.0011 1193.6871 1208.3721 1275.7824 1284.1628 1296.7995 1327.4315 1360.2237 1375.2962 1402.6509 1421.4904 1431.7863 1466.9198 1473.6173 1477.7455 1496.4532 1562.1475 1579.3455 1603.7671 1609.8820 2978.4682 3059.1178 3093.5309 3121.7326 3130.3507 3136.4675 3145.0161 3148.0914 3158.2592 3164.8470 3170.8166
redmass: 6.2425 4.1614 4.8016 6.7290 1.5155 1.8491 6.3119 4.8690 6.3117 3.7799 4.2106 2.9665 3.4704 2.9642 6.4496 3.6234 4.0916 3.5447 6.9511 6.8777 6.1604 3.6332 2.0715 1.7015 4.7004 6.5656 1.2416 1.5193 1.3405 1.3735 1.3685 1.5681 1.9661 1.9245 1.5148 2.5855 1.5478 2.2191 1.6943 2.0686 1.5982 1.0735 1.3397 2.3613 2.0685 1.7708 1.4601 5.6862 5.1298 7.2331 1.2195 4.0372 2.2088 2.1535 1.1704 1.1063 2.5398 6.6682 6.5054 6.2479 6.1602 1.0402 1.0938 1.0995 1.0866 1.0882 1.0876 1.0939 1.0880 1.0960 1.1009 1.0967
irintensity: 1.0479 0.5396 1.1228 0.9400 0.7085 0.3591 1.0331 5.1218 1.8934 0.7421 1.8963 0.7763 2.6689 9.0827 3.2726 5.8663 1.8978 5.4802 0.2445 0.1518 19.2811 0.7062 25.0726 68.7596 21.7423 30.2162 1.1427 54.8000 5.9455 0.6799 2.1894 0.5271 6.0570 3.6033 2.1849 1.1800 10.6917 2.8750 56.1567 238.6574 1.6378 1.9030 23.6092 2.6461 9.3227 19.3558 53.4498 221.8674 12.3007 4.7183 14.2575 21.9081 1.5699 14.5042 19.0199 31.6003 3.5694 10.0225 0.8361 131.9229 4.8956 21.4461 20.7384 15.6548 9.4981 3.9782 3.1218 26.1555 2.2150 5.6648 33.1436 8.5223
temp: 298.150 k
press: 1.00000 atm
elementType: 8 7 6 6 6 6 6 6 6 6 6 6 6 6 6 1 1 1 1 1 1 1 1 1 1 1
symmnumber: 1
zpe: 529519.3 jmol-1
zpe.correction: 0.201683 hartree
zpe.thermalcorrener: 0.214342 hartree
zpe.thermalcorrenthalpy: 0.215287 hartree
zpe.thermalcorrgfe: 0.162280 hartree
zpe.sumelectzpe: -630.851225 hartree
zpe.sumelectthermal: -630.838566 hartree
zpe.sumelectthermalent: -630.837622 hartree
zpe.sumelectthermalfe: -630.890628 hartree
dipole: -5.8698 0.4799 0.0615
dipole: 5.8897
quadrupole: -108.3889 -77.4665 -88.9720
quadrupole: 0.3450 0.8242 0.8347
quadrupole: -16.7798 14.1426 2.6372 0.3450 0.8242 0.8347
hfenergy: -631.0529083 hartree
pointgroup: C01 [X(C13H11N1O1)]
dipole: -2.2872907 0.3174423 0.1920572 debye
dipolederiv: -1.0932776 0.0474615 0.0078443 0.5732441 -0.2261648 -0.1035586 1.0353754 -0.1469529 -0.3512902 1.9703315 -0.130257 -0.06683 -0.4443687 -0.088897 0.1476977 -0.6836364 0.173713 0.0984422 -0.257765 0.0075678 0.0105832 -0.1148386 -0.0957212 -0.0267488 0.012588 -0.0072556 -0.0515753 0.961521 -0.0416524 -0.0153021 0.0256245 0.0255801 0.0586159 -0.0597482 0.0342548 0.1386454 0.1049626 0.1531827 0.0376817 -0.0703579 0.264162 0.0798399 -0.1688415 0.1257266 -0.0048944 0.0390007 -0.0644138 -0.0050791 0.1207032 0.0093493 0.0292046 0.2026953 0.0201693 -0.129873 -0.1189649 -0.1972932 -0.057515 -0.1765695 -0.0394712 0.0423582 -0.0401528 0.0288605 -0.1491036 -0.5150641 0.1009733 0.1990481 0.2407957 -0.1341404 0.0505866 0.2730626 0.0454286 -0.0070161 -0.5197166 -0.0685888 -0.1746544 -0.2146439 -0.1056588 0.0599715 -0.3041269 0.0717973 -0.0361867 -0.0052256 -0.0709091 -0.0016194 -0.043909 -0.104379 -0.0631033 0.0147363 -0.1080891 0.0418301 -0.1955624 0.0948482 0.0297866 0.1778814 0.0355288 0.0571945 0.0036062 0.0543214 -0.1435856 0.1003713 0.0027541 0.0064155 -0.0323428 0.0035086 0.044659 -0.0116339 0.0370124 -0.1288984 0.3116932 -0.0813857 -0.1413083 0.1059937 -0.0612032 0.0244392 0.1926349 0.0140971 -0.0276229 0.4897163 0.0343051 0.1282648 -0.1488882 -0.0579431 0.0624753 -0.164849 0.0743133 0.0460484 -1.4159742 0.0998658 0.0583252 -0.068336 0.0857676 -0.0441208 -0.2724179 -0.0303357 0.0242604 0.046898 0.0992579 0.024596 0.0926874 -0.0161929 -0.0359036 0.0249101 -0.0449338 0.1260133 0.0327201 -0.0396293 -0.0876024 -0.0302254 0.104945 -0.0622203 -0.0863577 -0.0501931 0.01108 0.0482711 0.0394135 0.0856326 0.0279996 0.0986657 -0.0755111 0.088235 -0.0711653 0.0098263 0.0039176 0.0728117 0.0220845 0.118508 -0.0574233 -0.0549482 0.0415909 -0.0452616 0.1343694 -0.0452038 0.1533568 -0.0384974 0.0692674 -0.048251 0.0209746 -0.0442077 0.0615239 0.0969964 -0.043399 -0.0752256 0.0707826 -0.0642287 0.0792246 -0.013141 0.0821916 0.0121349 0.0452511 0.114039 -0.0566908 -0.0592782 -0.0173933 0.0402729 0.0011263 -0.0532083 -0.0532708 -0.1157066 0.0168034 -0.0693878 -0.0212039 -0.0998369 -0.058572 -0.0651947 -0.0431364 -0.0612841 0.1428454 -0.1411583 -0.0180592 -0.0077433 -0.0127111 0.0919317 -0.0170548 -0.0010759 -0.0193682 0.1524888 0.0601143 0.0341479 0.0625525 -0.0097574 0.1290041 -0.0553918 0.0113671 -0.0544961 0.0493374 0.0509514 -0.0264537 -0.0669641 -0.0042976 0.1260776 -0.0622464 -0.0496005 -0.0607468 0.0283181 unknown
polarizability: 284.4012789|-8.5609531|118.8822296|-6.0239077|31.3855414|100.6322733 unknown
InChI: InChI=1S/C13H11NO/c1-10-4-2-3-5-13(10)11-6-8-12(14-15)9-7-11/h2-9H,1H3
charge 0 multiplicity 1
26 atoms
O  5.048938 -0.716822 -0.84297
N  4.413443 -0.183553 0.142285
C  -1.367506 -0.103599 -0.071402
C  0.124664 -0.099149 -0.03721
C  -2.16421 1.041018 0.259614
C  -2.018705 -1.310768 -0.459483
C  -3.576763 0.918459 0.200826
C  0.859331 -0.696507 -1.110575
C  0.851496 0.442759 1.061939
C  -1.573611 2.39524 0.625507
C  -3.422354 -1.413364 -0.500326
C  -4.209498 -0.288856 -0.163832
C  2.259812 -0.742897 -1.098546
C  2.256312 0.395279 1.088165
C  2.96383 -0.193114 0.008611
H  -1.407296 -2.188984 -0.696238
H  0.307421 -1.097265 -1.968033
H  0.307619 0.870727 1.908861
H  -4.188914 1.797003 0.438328
H  -2.259148 3.205818 0.322875
H  -0.59856 2.573583 0.142109
H  -1.420943 2.493657 1.717738
H  -3.895992 -2.358475 -0.786359
H  -5.303031 -0.348376 -0.193507
H  2.832831 -1.185214 -1.920889
H  2.830734 0.795402 1.930712
