program: Orca
programVersion: 5.0.3
elementType: C H C H C C C H H C H H C C H H H H H H H
charge: 1
multiplicity: 1
keywords: DSD-PBEP86 cc-pVTZ EnGrad RIJCOSX verytightscf cc-pVTZ/C def2/J soscf
formula: C8H13
InChI: InChI=1/C8H13/c1-2-4-6-8-7-5-3-1/h1-2,7H,3-6,8H2
21 atoms
C  -2.006224 0.702976 0.086356
H  -2.217102 0.879559 1.145186
C  -1.783597 -0.921329 -0.139956
H  -2.623277 -1.398814 0.368694
C  -0.434467 -1.342726 0.41143
C  0.699376 -1.281652 -0.361944
C  2.010642 -0.685414 0.076372
H  2.224915 -0.88206 1.131628
H  2.85837 -1.016187 -0.526708
C  1.806707 0.907654 -0.140371
H  1.868315 1.134444 -1.209727
H  2.623463 1.427153 0.363974
C  0.430919 1.292829 0.421012
C  -0.723008 1.312164 -0.360242
H  0.530657 -1.201484 -1.440365
H  -1.860895 -1.13037 -1.210853
H  0.025507 0.078042 0.444948
H  -0.570624 1.282806 -1.443537
H  -2.864091 1.002301 -0.517515
H  0.346588 1.501742 1.491691
H  -0.346028 -1.493214 1.489628
totalener: -311.09417316 hartree
nucrepener: 382.25825024 hartree
electener: -693.35242340 hartree
oneelecener: -1164.50330188 hartree
twoeener: 471.15087848 hartree
kineticenergy: 309.65289924 hartree
exchangeener: -12.747527062051 hartree
correlationener: -0.948456898919 hartree
xcener: -13.695983960970 hartree
chargesum: 1.0000000
charge: -0.250759 0.178183 -0.281687 0.189947 -0.085910 -0.062540 -0.247803 0.171447 0.186594 -0.273230 0.171437 0.187160 -0.096371 -0.019358 0.180918 0.175665 0.085184 0.192263 0.192174 0.206180 0.200506
charge: 0.107522 -0.000558 0.117548 0.002303 0.090685 0.146028 0.097470 -0.002543 0.001451 0.115555 -0.005294 0.000489 0.114794 0.197686 -0.001774 -0.004843 -0.002888 0.006146 0.004033 0.015588 0.000602
qa: -0.2508 0.1782 -0.2817 0.1899 -0.0859 -0.0625 -0.2478 0.1714 0.1866 -0.2732 0.1714 0.1872 -0.0964 -0.0194 0.1809 0.1757 0.0852 0.1923 0.1922 0.2062 0.2005
va: 3.8817 0.9797 3.9362 0.9722 3.7927 3.8190 3.8871 0.9821 0.9719 3.9288 0.9819 0.9748 3.7872 3.7702 0.9804 0.9798 1.1237 0.9760 0.9712 0.9772 0.9770
energy: -311.810939283550
dipole: -0.00394 -0.13903 -0.14297 0.17263 0.05557 0.22820 0.08171 -0.09926 -0.01755
magnitude: 0.26986 au
magnitude: 0.68593 debye
