program: Orca
programVersion: 5.0.3
elementType: C H C H C C C H H C H H C C H H H H H H H
charge: 1
multiplicity: 1
keywords: DSD-PBEP86 def2-TZVP D3BJ RIJCOSX verytightscf def2-TZVP/C def2/J soscf noTRAH
formula: C8H13
InChI: InChI=1/C8H13/c1-2-4-6-8-7-5-3-1/h1-2,7H,3-6,8H2
21 atoms
C  -2.003188 0.732475 0.07026
H  -2.171557 0.803273 1.147955
C  -1.737325 -0.974824 -0.168646
H  -2.622208 -1.354151 0.347771
C  -0.410202 -1.381127 0.384275
C  0.678489 -1.269194 -0.393122
C  1.991925 -0.703744 0.064015
H  2.192206 -0.919488 1.118867
H  2.850633 -1.038219 -0.525319
C  1.790254 0.834242 -0.128861
H  1.823075 1.097733 -1.19193
H  2.596977 1.383837 0.363445
C  0.430251 1.310297 0.497958
C  -0.762355 1.284124 -0.349583
H  0.515411 -1.188223 -1.472444
H  -1.828578 -1.138695 -1.24356
H  0.235882 0.818798 1.453982
H  -0.658328 1.637441 -1.3796
H  -2.877357 0.996233 -0.52454
H  0.533059 2.395348 0.725759
H  -0.321113 -1.462019 1.466882
totalener: -311.11347602 hartree
nucrepener: 379.05764057 hartree
electener: -690.17111659 hartree
oneelecener: -1158.56731346 hartree
twoeener: 468.39619688 hartree
kineticenergy: 310.01372947 hartree
exchangeener: -13.665808200741 hartree
correlationener: -0.921233089743 hartree
xcener: -14.587041290484 hartree
chargesum: 1.0000000
charge: -0.270210 0.196811 -0.199288 0.190164 -0.203960 -0.108192 -0.208997 0.152791 0.164050 -0.267173 0.152804 0.170208 -0.153661 0.114873 0.138971 0.185338 0.158153 0.217572 0.193800 0.207270 0.168677
charge: -0.168335 0.169005 -0.119601 0.155758 -0.178032 -0.128554 -0.217339 0.148817 0.149043 -0.199455 0.142975 0.150472 -0.203774 0.152240 0.151111 0.151788 0.163059 0.175214 0.157783 0.199177 0.148647
qa: -0.2702 0.1968 -0.1993 0.1902 -0.2040 -0.1082 -0.2090 0.1528 0.1641 -0.2672 0.1528 0.1702 -0.1537 0.1149 0.1390 0.1853 0.1582 0.2176 0.1938 0.2073 0.1687
va: 3.8789 0.9590 3.8310 0.9595 3.8608 3.8439 3.8755 0.9733 0.9728 3.9062 0.9687 0.9652 3.8118 3.5283 0.9689 0.9598 0.9868 0.9415 0.9657 0.9495 0.9652
total: -311.785026568 hartree
dispcorr: -0.011833948 hartree
energy: -311.796860516007
dipole: 0.25106 -1.10531 -0.85426 1.90253 -0.57529 1.32724 0.26897 -0.45705 -0.18808
magnitude: 1.58956 au
magnitude: 4.04034 debye
