program: Orca
programVersion: 5.0.3
elementType: C H C H C C C H H C H H C C H H H H H H H
charge: 1
multiplicity: 1
keywords: PBE0 def2-TZVP EnGrad RIJCOSX verytightscf def2/J soscf
formula: C8H13
InChI: InChI=1/C8H13/c1-2-4-6-8-7-5-3-1/h1-2,7H,3-6,8H2
21 atoms
C  -1.989926 0.565932 0.10131
H  -2.166235 0.747497 1.166609
C  -1.864111 -0.970542 -0.174585
H  -2.661125 -1.521925 0.331294
C  -0.462243 -1.268759 0.331099
C  0.637503 -1.211841 -0.46024
C  1.928962 -0.685464 0.072563
H  2.074092 -0.946276 1.126167
H  2.797632 -1.037586 -0.493145
C  1.839818 0.867839 -0.083638
H  1.89749 1.132794 -1.146018
H  2.685105 1.35269 0.413002
C  0.509095 1.450537 0.511011
C  -0.645139 1.083948 -0.310601
H  0.529645 -1.294537 -1.542591
H  -1.934632 -1.167356 -1.249239
H  0.370177 1.190365 1.563736
H  -0.528116 1.282985 -1.380408
H  -2.79513 1.019918 -0.487404
H  0.614673 2.551151 0.442653
H  -0.329374 -1.266632 1.414461
totalener: -312.06397069 hartree
nucrepener: 381.33132632 hartree
electener: -693.39529702 hartree
oneelecener: -1163.68105300 hartree
twoeener: 470.28575599 hartree
kineticenergy: 310.15879380 hartree
exchangeener: -34.173139612504 hartree
correlationener: -1.964931049516 hartree
xcener: -36.138070662019 hartree
chargesum: 1.0000000
charge: -0.192574 0.169329 -0.208306 0.175453 -0.117097 -0.104237 -0.221018 0.160621 0.172799 -0.248953 0.158613 0.176616 -0.155779 -0.002815 0.169183 0.164504 0.159953 0.198386 0.179929 0.201301 0.164093
charge: -0.207287 0.164024 -0.202564 0.155769 -0.083328 -0.108910 -0.223317 0.157941 0.163732 -0.204694 0.152711 0.157211 -0.224189 0.118267 0.162018 0.158756 0.161947 0.173892 0.165841 0.200162 0.162017
qa: -0.1926 0.1693 -0.2083 0.1755 -0.1171 -0.1042 -0.2210 0.1606 0.1728 -0.2490 0.1586 0.1766 -0.1558 -0.0028 0.1692 0.1645 0.1600 0.1984 0.1799 0.2013 0.1641
va: 3.9010 0.9701 3.8967 0.9692 3.9425 3.9163 3.9497 0.9696 0.9695 3.9445 0.9685 0.9622 3.9217 3.7626 0.9621 0.9733 0.9744 0.9460 0.9679 0.9571 0.9636
energy: -312.063970692170
dipole: 0.51931 -0.86021 -0.34090 1.91260 -1.12588 0.78672 0.14891 -0.27242 -0.12351
magnitude: 0.86626 au
magnitude: 2.20186 debye
