program: Orca
programVersion: 5.0.3
elementType: C H C H C C C H H C H H C C H H H H H H H
charge: 1
multiplicity: 1
keywords: DSD-PBEP86 cc-pVTZ EnGrad RIJCOSX verytightscf cc-pVTZ/C def2/J soscf
formula: C8H13
InChI: InChI=1/C8H13/c1-2-4-6-8-7-5-3-1/h1-2,7H,3-6,8H2
21 atoms
C  -2.002607 0.722585 0.080804
H  -2.206275 0.874309 1.144616
C  -1.76289 -0.928799 -0.143872
H  -2.619196 -1.366557 0.373914
C  -0.429752 -1.356097 0.409155
C  0.697827 -1.284529 -0.364014
C  2.00908 -0.687027 0.070879
H  2.222681 -0.879509 1.127658
H  2.859253 -1.021267 -0.527607
C  1.802009 0.898191 -0.143812
H  1.861146 1.132721 -1.211785
H  2.616406 1.42517 0.357158
C  0.425227 1.273029 0.436698
C  -0.741591 1.319262 -0.369844
H  0.530673 -1.208028 -1.443027
H  -1.851279 -1.127632 -1.214413
H  0.070723 0.187981 0.722475
H  -0.600479 1.336402 -1.454927
H  -2.868523 0.993095 -0.52449
H  0.364598 1.68801 1.450572
H  -0.347537 -1.517215 1.486248
totalener: -311.09282026 hartree
nucrepener: 381.40577174 hartree
electener: -692.49859200 hartree
oneelecener: -1162.95039820 hartree
twoeener: 470.45180620 hartree
kineticenergy: 309.66793263 hartree
exchangeener: -12.747595173877 hartree
correlationener: -0.946739285656 hartree
xcener: -13.694334459534 hartree
chargesum: 1.0000000
charge: -0.251505 0.184723 -0.279770 0.195135 -0.119335 -0.087645 -0.246320 0.166641 0.182765 -0.273870 0.169179 0.185201 -0.161496 0.035934 0.176467 0.181858 0.120776 0.203172 0.198092 0.220255 0.199743
charge: 0.113786 0.004096 0.129977 0.005847 0.052744 0.120391 0.088207 -0.003329 -0.000941 0.113176 -0.008120 -0.000742 0.099827 0.250556 -0.008766 -0.003971 0.007510 0.009711 0.006525 0.029541 -0.006024
qa: -0.2515 0.1847 -0.2798 0.1951 -0.1193 -0.0876 -0.2463 0.1666 0.1828 -0.2739 0.1692 0.1852 -0.1615 0.0359 0.1765 0.1819 0.1208 0.2032 0.1981 0.2203 0.1997
va: 3.8813 0.9773 3.9419 0.9693 3.8142 3.8335 3.8948 0.9835 0.9729 3.9240 0.9826 0.9760 3.8160 3.6947 0.9790 0.9771 1.0886 0.9701 0.9699 0.9722 0.9768
energy: -311.807017467867
dipole: 0.03019 -0.46069 -0.43049 0.48543 0.06651 0.55194 0.26865 -0.29438 -0.02573
magnitude: 0.70044 au
magnitude: 1.78039 debye
