program: Gaussian 09
title: 000051161
version: EM64L-G09RevD.01
frameworkgroup: C1[X(C15H21NO3)]
method: RPBEPBE
basis: SDD
operation: Freq
keyword: #p
keyword: freq=noraman
keyword: PBEPBE/SDD
title: #p freq=noraman PBEPBE/SDD
converged: YES YES NO NO
title: Mulliken charges:
elementType: O O O N C C C C C C C C C C C C C C C H H H H H H H H H H H H H H H H H H H H H
charge: -0.268690 -0.241433 -0.432845 -0.046153 0.090121 -0.467272 -0.492418 -0.398647 -0.403314 0.454651 0.206125 -0.619634 -0.366306 -0.365342 -0.379027 -0.422540 0.284486 -0.219383 -0.676419 0.218244 0.226835 0.227219 0.219717 0.208597 0.196770 0.200336 0.209039 0.223539 0.221546 0.186176 0.241275 0.236191 0.250731 0.217837 0.228187 0.228065 0.211809 0.228081 0.230656 0.353190
chargesum: 0.00000
title: Mulliken charges with hydrogens summed into heavy atoms:
elementType: O O O N C C C C C C C C C C C C C C C
charge: -0.268690 -0.241433 -0.079655 -0.046153 0.090121 -0.022193 -0.045481 0.006720 0.006061 0.454651 0.206125 0.011626 -0.125031 -0.129151 -0.128296 -0.204703 0.284486 0.236869 -0.005873
polarizability: 1.67920292e+02 1.33780000e+01 1.93644479e+02 -3.32310857e+00 -2.73844317e+00 1.65056880e+02
1716.lowfreq: -6.5922 -4.7528 -0.0007 0.0003 0.0005 1.1742 24.3371 32.7628 48.0900
frequency: 24.2175 32.4548 48.0134 66.0162 72.1453 91.8637 121.1978 138.3651 172.4764 188.2216 204.6052 235.6488 249.5599 254.7923 265.4002 309.0863 332.8718 345.7706 352.1742 360.7994 372.2253 376.7594 408.3516 410.8554 459.0541 482.1813 495.3052 526.1881 546.0214 625.4257 636.8599 683.4689 730.6953 743.3870 758.1506 799.9158 804.1556 806.6881 807.1030 818.8988 836.7322 876.6538 927.8552 935.0629 952.5828 962.9093 1002.6857 1003.4243 1020.8532 1025.1168 1050.6024 1065.0779 1081.8066 1104.9620 1112.1572 1120.5849 1134.5290 1135.6331 1136.7936 1145.2371 1168.7679 1175.7710 1187.3032 1190.1646 1211.5981 1249.0306 1251.6924 1280.7718 1282.3680 1294.0632 1314.5272 1329.6742 1348.6607 1352.4277 1355.2441 1376.2637 1381.7182 1400.3987 1420.8959 1430.5316 1460.5499 1461.9972 1462.2557 1463.5220 1474.0084 1476.9918 1480.5711 1481.5838 1486.4280 1503.3814 1593.0022 1613.0703 1624.5349 2840.9755 2844.8345 2860.8730 2995.1552 3006.4290 3010.0705 3014.2470 3014.7312 3021.6216 3030.3194 3068.1939 3073.3136 3077.5435 3085.3603 3091.3670 3107.1166 3111.7439 3145.0117 3163.7779 3172.0906 3579.9006
redmass: 3.9085 3.6547 4.2992 3.2274 3.8012 3.4197 3.3346 2.5465 3.3854 3.1598 4.1313 1.1455 2.4912 1.6052 4.4571 2.6712 4.7776 2.1034 3.1419 1.1445 2.5201 3.2317 3.6926 2.9509 3.7971 3.1987 3.3821 2.7765 2.5342 3.9208 6.8383 5.0102 4.5326 3.5355 5.1642 1.1144 1.6609 1.8244 3.7795 2.1616 1.6636 3.0295 1.8757 1.5807 2.4574 1.4049 2.9452 2.7393 1.7005 2.3896 2.4165 1.7417 1.9083 1.7034 2.1870 1.6516 2.3378 1.6198 2.6610 1.4014 2.8733 2.8717 1.0964 1.1305 2.4831 1.1344 2.4468 1.8895 1.5203 1.5764 1.3487 1.3476 1.3816 1.3349 1.3621 1.4074 4.7168 1.2669 3.1922 1.1795 1.0812 1.0804 1.0562 1.0418 1.0615 1.1102 1.1118 1.0554 1.0687 2.3649 6.3364 11.1456 6.4799 1.0703 1.0636 1.0637 1.0358 1.0739 1.0583 1.0729 1.0720 1.0767 1.0787 1.1065 1.1010 1.0987 1.0993 1.0984 1.1026 1.0897 1.0880 1.0926 1.0961 1.0660
irintensity: 0.5958 0.8093 0.1451 1.0290 0.1598 1.1024 1.0223 0.2846 0.9150 5.0268 2.6823 0.1282 1.0636 3.2250 1.1982 4.9075 9.5154 5.8301 7.9108 138.1580 1.1170 5.1351 8.1000 0.5954 3.5638 0.5643 3.1841 25.1021 6.8650 10.6080 2.8463 9.4550 2.9054 2.5836 7.6736 5.7769 23.6636 2.4279 14.1645 1.8945 42.5764 1.5445 3.6811 0.8716 19.5465 2.8441 22.6545 36.6345 10.1538 90.4599 51.7710 30.6931 36.2464 46.2022 7.1656 13.8126 35.9397 5.1881 20.6789 234.3127 165.6482 68.8764 17.9818 15.3810 17.8968 0.0530 22.7342 18.7974 0.8613 19.6029 5.4351 2.4630 3.0091 2.3636 1.3531 4.2675 23.6433 23.7668 9.3754 1.3958 10.5748 5.5032 28.3424 13.4145 7.9750 41.8838 4.3566 6.6302 12.0662 84.4441 15.6002 141.4846 63.8752 36.9243 54.5241 206.7032 20.8641 13.4456 18.5022 12.1039 55.3905 62.3701 59.2858 7.3488 31.3413 24.0594 28.6078 31.4885 43.5787 20.5159 5.4826 13.7593 3.1829 41.0899
temp: 298.150 k
press: 1.00000 atm
elementType: 8 8 8 7 6 6 6 6 6 6 6 6 6 6 6 6 6 6 6 1 1 1 1 1 1 1 1 1 1 1 1 1 1 1 1 1 1 1 1 1
symmnumber: 1
zpe: 877383.6 jmol-1
zpe.correction: 0.334178 hartree
zpe.thermalcorrener: 0.353312 hartree
zpe.thermalcorrenthalpy: 0.354256 hartree
zpe.thermalcorrgfe: 0.286038 hartree
zpe.sumelectzpe: -863.153358 hartree
zpe.sumelectthermal: -863.134224 hartree
zpe.sumelectthermalent: -863.133280 hartree
zpe.sumelectthermalfe: -863.201499 hartree
dipole: 0.5137 0.4262 -3.5193
dipole: 3.5820
quadrupole: -106.9121 -111.6092 -110.7139
quadrupole: -4.8979 -5.7578 -3.4852
quadrupole: 2.8330 -1.8641 -0.9688 -4.8979 -5.7578 -3.4852
hfenergy: -863.4875361 hartree
pointgroup: C01 [X(C15H21N1O3)]
dipole: -0.2705392 0.1784783 1.3714946 debye
polarizability: 182.613771|-18.7456133|179.1004828|-2.4555824|-0.2555541|164.9073976 unknown
InChI: InChI=1S/C15H21NO3/c1-3-19-14(18)15(8-10-16(2)11-9-15)12-4-6-13(17)7-5-12/h4-7,17H,3,8-11H2,1-2H3
charge 0 multiplicity 1
40 atoms
O  -0.655902 -2.436462 0.505268
O  -0.239116 -2.278009 -1.775772
O  -3.556745 3.457226 -0.116673
N  3.342392 0.698295 0.253729
C  0.668681 -0.533687 -0.245841
C  1.712017 -0.245797 -1.369743
C  1.46947 -0.725818 1.076941
C  2.613899 0.948895 -1.014212
C  2.399961 0.46776 1.374161
C  -0.430919 0.563525 -0.164954
C  -0.092182 -1.826497 -0.615369
C  4.315776 1.763759 0.558084
C  -1.044766 1.041845 -1.355681
C  -0.915166 1.068076 1.067263
C  -2.076484 1.998498 -1.325918
C  -1.948002 2.029128 1.117295
C  -2.526653 2.499741 -0.084068
C  -1.499163 -3.643177 0.238423
C  -2.006083 -4.133888 1.590322
H  1.216103 -0.073927 -2.338951
H  2.345842 -1.143275 -1.492226
H  2.099216 -1.627959 0.964713
H  0.796388 -0.914757 1.929757
H  3.359574 1.095143 -1.818282
H  1.999633 1.885254 -0.95662
H  1.79451 1.386311 1.587124
H  2.990055 0.24795 2.284334
H  5.035224 1.859592 -0.275055
H  4.882103 1.502387 1.470487
H  3.841585 2.76588 0.721248
H  -0.728551 0.649254 -2.327603
H  -0.495646 0.711057 2.011861
H  -2.544816 2.360111 -2.246029
H  -2.298646 2.405006 2.087732
H  -2.318621 -3.346118 -0.441101
H  -0.876864 -4.393622 -0.281898
H  -2.643329 -5.026054 1.4492
H  -1.166149 -4.408354 2.251353
H  -2.605203 -3.354666 2.091685
H  -3.803424 3.739574 0.798917
