program: Orca
programVersion: 5.0.3
elementType: C H C H C C C H H C H H C C H H H H H H H
charge: 1
multiplicity: 1
keywords: DSD-PBEP86/2013 cc-pVTZ EnGrad D3BJ RIJCOSX verytightscf cc-pVTZ/C def2/J soscf
formula: C8H13
InChI: InChI=1/C8H13/c1-2-4-6-8-7-5-3-1/h1-2,7H,3-6,8H2
21 atoms
C  -1.994902 0.613941 0.081506
H  -2.172929 0.777979 1.150831
C  -1.806203 -0.952561 -0.171762
H  -2.64365 -1.463335 0.312556
C  -0.428946 -1.326908 0.361361
C  0.658712 -1.25039 -0.427451
C  1.957176 -0.702784 0.07147
H  2.134742 -0.941793 1.125059
H  2.823917 -1.034199 -0.510576
C  1.815598 0.843005 -0.109183
H  1.85371 1.101016 -1.173579
H  2.641162 1.367692 0.379755
C  0.468111 1.396488 0.507121
C  -0.707295 1.205454 -0.326423
H  0.522584 -1.241817 -1.511707
H  -1.863698 -1.146406 -1.247457
H  0.312193 1.039586 1.527501
H  -0.617819 1.542477 -1.364214
H  -2.835075 0.989432 -0.510219
H  0.614849 2.497091 0.539769
H  -0.314721 -1.38023 1.444807
totalener: -311.13939676 hartree
nucrepener: 379.85044760 hartree
electener: -690.98984436 hartree
oneelecener: -1160.11117932 hartree
twoeener: 469.12133496 hartree
kineticenergy: 309.72390999 hartree
exchangeener: -14.119425883811 hartree
correlationener: -0.942907730696 hartree
xcener: -15.062333614507 hartree
chargesum: 1.0000000
charge: -0.228007 0.184227 -0.236104 0.182603 -0.150773 -0.157308 -0.232802 0.162416 0.177632 -0.244217 0.157548 0.180803 -0.232730 0.080583 0.183948 0.169546 0.172167 0.239622 0.189708 0.213002 0.188138
charge: 0.099632 0.012359 0.104431 0.000794 0.069088 0.051856 0.070587 -0.002528 0.003725 0.114625 -0.008762 -0.000629 0.077958 0.360336 -0.017463 -0.000768 0.005648 0.021246 0.009799 0.046881 -0.018815
qa: -0.2280 0.1842 -0.2361 0.1826 -0.1508 -0.1573 -0.2328 0.1624 0.1776 -0.2442 0.1575 0.1808 -0.2327 0.0806 0.1839 0.1695 0.1722 0.2396 0.1897 0.2130 0.1881
va: 3.8565 0.9775 3.9115 0.9731 3.8304 3.8445 3.9022 0.9860 0.9771 3.8791 0.9833 0.9726 3.9125 3.5133 0.9773 0.9823 0.9872 0.9518 0.9762 0.9653 0.9803
dispcorr: -0.014158356 hartree
energy: -311.823893244391
dipole: 0.42650 -0.97755 -0.55104 1.97302 -0.72539 1.24763 0.15210 -0.28936 -0.13726
magnitude: 1.37079 au
magnitude: 3.48428 debye
