program: Gaussian 09
title: 000051152
version: EM64L-G09RevD.01
frameworkgroup: C1[X(C6H12N2O3)]
method: RPBEPBE
basis: SDD
operation: Freq
keyword: #p
keyword: freq=noraman
keyword: PBEPBE/SDD
title: #p freq=noraman PBEPBE/SDD
converged: YES YES NO NO
title: Mulliken charges:
elementType: O O O N N C C C C C C H H H H H H H H H H H H
charge: -0.225137 -0.258949 -0.261515 -0.061992 0.063624 -0.047359 -0.660194 -0.676254 -0.332962 0.317518 -0.742227 0.263298 0.218541 0.234245 0.215277 0.226818 0.209553 0.241705 0.265737 0.253285 0.253681 0.256560 0.246747
chargesum: 0.00000
title: Mulliken charges with hydrogens summed into heavy atoms:
elementType: O O O N N C C C C C C
charge: -0.225137 -0.258949 -0.261515 -0.061992 0.063624 0.215939 0.007869 0.001823 0.186060 0.317518 0.014761
polarizability: 1.01154967e+02 -2.49934105e+00 1.01490280e+02 1.14718816e+00 3.05993183e+00 7.23751785e+01
1716.lowfreq: -19.5188 -9.3755 -4.7028 0.0007 0.0009 0.0010 10.0544 21.7519 29.2595
frequency: -18.9300 21.0614 29.1361 82.9635 85.8537 137.4134 193.0527 200.1587 213.8228 239.4849 277.3354 311.3268 346.9966 389.4375 424.6789 472.8821 543.5310 581.1290 603.1381 634.5466 766.3561 808.5439 867.5767 888.4517 926.7739 935.1248 945.9476 986.2357 1044.3868 1058.3739 1118.0652 1145.8812 1180.1873 1190.8037 1213.9850 1314.4834 1330.3484 1346.8090 1377.7605 1384.2919 1390.9052 1394.9339 1395.8027 1425.5147 1451.3524 1453.7051 1459.5452 1468.0860 1474.2378 1488.1929 1647.1409 2984.2139 2996.8295 3009.3444 3040.1475 3053.9734 3081.9440 3092.4211 3095.4720 3099.1345 3110.8968 3133.6978 3145.0281
redmass: 2.7261 1.0983 6.6754 4.3758 3.8922 4.1305 1.4789 4.4934 1.9149 1.2627 3.7976 4.6727 2.5124 2.7529 3.0528 3.2177 3.7926 3.7433 3.6262 4.3506 4.3000 3.9916 5.5380 3.1943 1.2213 2.9361 1.6242 1.8879 1.6612 2.0205 2.4546 2.3845 2.1435 2.9166 2.9165 1.3508 1.3432 2.9187 1.2099 1.2329 1.4307 1.3553 1.2118 1.1534 1.0593 1.0512 1.0438 1.0497 1.0495 1.0558 8.6989 1.0353 1.0357 1.0373 1.0866 1.0555 1.0998 1.1003 1.1003 1.0962 1.1000 1.1101 1.1016
irintensity: 0.2065 1.6169 3.7006 6.5100 0.7999 2.3290 1.3481 3.9302 1.8551 0.5318 4.1660 0.5036 2.9085 8.7731 9.3353 4.6196 5.2189 10.5849 3.7782 3.9378 10.2179 29.2165 169.9963 76.4741 4.2894 44.1230 7.1762 91.4048 11.6986 35.8711 131.7658 14.0485 36.5044 188.6064 63.3621 11.1775 1.5634 82.8370 21.3957 38.8770 26.1692 6.1687 10.1630 35.7988 28.6058 21.7801 4.2764 2.8630 16.4685 13.8168 171.9530 21.6887 16.8580 1.2937 2.0596 16.3427 28.8822 15.9736 35.1377 5.4623 21.3693 2.9220 8.2391
temp: 298.150 k
press: 1.00000 atm
elementType: 8 8 8 7 7 6 6 6 6 6 6 1 1 1 1 1 1 1 1 1 1 1 1
symmnumber: 1
zpe: 481561.9 jmol-1
zpe.correction: 0.183417 hartree
zpe.thermalcorrener: 0.195860 hartree
zpe.thermalcorrenthalpy: 0.196804 hartree
zpe.thermalcorrgfe: 0.143037 hartree
zpe.sumelectzpe: -570.066174 hartree
zpe.sumelectthermal: -570.053731 hartree
zpe.sumelectthermalent: -570.052787 hartree
zpe.sumelectthermalfe: -570.106554 hartree
dipole: 1.4036 -2.3793 -0.9294
dipole: 2.9146
quadrupole: -59.1908 -77.8523 -62.6208
quadrupole: 8.6451 4.3645 -4.5070
quadrupole: 7.3639 -11.2976 3.9338 8.6451 4.3645 -4.5070
hfenergy: -570.2495909 hartree
pointgroup: C01 [X(C6H12N2O3)]
dipole: -0.7095347 -0.7940891 0.4252869 debye
dipolederiv: -1.1396738 -0.4509229 -0.189448 -0.5514716 -0.823351 -0.1470929 -0.424953 -0.1401379 -0.4630445 -0.1808614 0.2406936 -0.0580857 -0.44834 -1.0655437 0.3715379 0.1172035 0.1452718 -0.2791223 -0.6061983 0.0225329 -0.1867783 -0.2154051 -0.8186511 0.1565563 -0.0554344 0.3448027 -0.5577231 -0.7935242 -0.5858642 0.1951628 0.0656617 -0.561824 0.1134338 0.1673584 0.2504752 -0.4623394 0.2560894 0.4153152 -0.2498431 0.7225474 1.0759154 -0.5008321 -0.316115 -0.4846101 0.1873296 0.1824726 -0.122646 0.1048975 -0.2335081 0.5340099 -0.0933165 0.1460938 -0.0106701 0.304248 -0.0045783 0.0298626 -0.0841039 0.0123857 -0.0145794 -0.0131965 -0.0934371 -0.0179657 -0.0541012 0.0145403 0.0373473 0.0215287 0.0667744 -0.0031849 -0.0248732 0.0262762 -0.0439015 -0.0765862 1.1361485 0.155803 0.1328882 -0.1652879 0.1241656 0.1459375 0.3503742 0.2044236 0.4775668 1.0839797 0.3660182 0.4726242 0.747212 1.3399924 -0.1281603 0.3605273 -0.3363163 0.6963605 -0.2462504 0.0086822 -0.2154019 0.0472936 -0.0245785 0.0829932 -0.2393149 0.0351573 -0.1816641 0.0230859 -0.0421702 0.0375178 -0.0135391 0.030911 0.0055516 0.025233 0.0008696 0.0413908 0.0754064 0.06237 -0.0414407 0.0672986 -0.1373539 0.0821061 -0.0346726 0.059919 0.0661703 -0.0568351 -0.0676137 -0.00353 -0.0994692 0.051323 0.0144846 0.0653798 0.0450553 0.0586972 0.0254647 0.0494706 0.100278 0.0469903 0.0443541 -0.1117288 0.0585247 -0.0938843 -0.0778664 0.0013433 -0.0043954 -0.1186078 0.0062618 0.100071 0.0034647 -0.0983719 -0.0182074 -0.0913638 0.0865067 0.0535362 -0.0010015 0.0707392 -0.1480879 0.0449736 -0.0035382 0.0705255 0.0739634 -0.0494863 -0.0508365 0.0511988 -0.1120324 0.0680141 0.0191694 0.0213123 -0.0142453 0.0813662 0.0293898 -0.0458449 -0.040188 0.0552584 0.0045857 -0.0770844 -0.0600771 0.0072526 0.1068055 -0.0076004 -0.0462443 0.0146318 0.0023598 0.1120516 0.1088748 -0.0461907 0.0109029 -0.0293307 0.0303487 0.0709702 0.0072841 0.0830618 0.0449736 -0.0570605 0.0425159 -0.0581812 0.0916865 0.0730033 -0.0383094 0.085032 -0.0583237 0.110288 0.0397374 0.0357826 0.0434342 -0.0064747 0.0672289 -0.0577543 -0.034615 -0.0964676 -0.0435011 -0.0354758 -0.0444767 0.0000302 0.0940319 unknown
polarizability: 99.2809668|5.28447|97.7543624|6.7908933|-9.0066063|77.9850963 unknown
InChI: InChI=1S/C6H12N2O3/c1-5(2)8(7-10)4-11-6(3)9/h5H,4H2,1-3H3
charge 0 multiplicity 1
23 atoms
O  -1.493577 0.718897 -0.461541
O  1.483792 2.196352 -0.661167
O  -2.053013 -1.432979 0.256042
N  0.821873 0.215302 0.20208
N  1.812002 0.980075 -0.42149
C  1.215806 -1.190203 0.557254
C  2.122202 -1.189714 1.809841
C  1.879773 -1.89864 -0.641745
C  -0.445643 0.797416 0.60928
C  -2.247635 -0.464616 -0.514318
C  -3.29762 -0.368058 -1.596299
H  0.262046 -1.697085 0.787536
H  2.357229 -2.227792 2.105531
H  3.068882 -0.66236 1.597706
H  1.629687 -0.693904 2.666278
H  1.22001 -1.878862 -1.526629
H  2.07718 -2.953252 -0.37979
H  2.83375 -1.414858 -0.907695
H  -0.316164 1.881273 0.747412
H  -0.81721 0.280934 1.508522
H  -4.074549 0.358213 -1.297594
H  -2.849484 -0.000682 -2.534125
H  -3.762336 -1.351955 -1.752989
