program: Orca
programVersion: 5.0.3
elementType: C H C H C C C H H C H H C C H H H H H H H
charge: 1
multiplicity: 1
keywords: DSD-PBEP86/2013 cc-pVTZ EnGrad RIJCOSX verytightscf cc-pVTZ/C def2/J soscf
formula: C8H13
InChI: InChI=1/C8H13/c1-2-4-6-8-7-5-3-1/h1-2,7H,3-6,8H2
21 atoms
C  -1.997068 0.531378 0.120048
H  -2.174447 0.723357 1.18181
C  -1.950467 -0.995568 -0.171029
H  -2.675345 -1.587052 0.390743
C  -0.51469 -1.148184 0.284325
C  0.611875 -1.129137 -0.501871
C  1.907957 -0.653926 0.065829
H  2.010142 -0.952114 1.114664
H  2.764575 -1.044316 -0.490401
C  1.891057 0.910553 -0.038479
H  2.01188 1.201212 -1.088721
H  2.73957 1.329086 0.509212
C  0.555208 1.481576 0.491797
C  -0.553791 0.840107 -0.26694
H  0.5316 -1.302295 -1.574635
H  -2.062739 -1.203081 -1.239342
H  0.437385 1.353161 1.572587
H  -0.425437 0.902643 -1.35049
H  -2.721902 1.094447 -0.476836
H  0.530504 2.564107 0.284922
H  -0.365353 -1.097432 1.36419
totalener: -311.17625145 hartree
nucrepener: 385.20427933 hartree
electener: -696.38053078 hartree
oneelecener: -1170.64693183 hartree
twoeener: 474.26640105 hartree
kineticenergy: 309.73744301 hartree
exchangeener: -12.759651037922 hartree
correlationener: -0.947684745650 hartree
xcener: -13.707335783572 hartree
chargesum: 1.0000000
charge: -0.222389 0.170219 -0.236680 0.185458 -0.068886 -0.074420 -0.253196 0.166201 0.184636 -0.251974 0.161113 0.183898 -0.237012 -0.059135 0.225468 0.168858 0.166662 0.206180 0.184615 0.200022 0.200362
charge: 0.094117 0.000584 0.098668 -0.000261 0.126601 0.156486 0.080130 0.001593 0.006945 0.097045 -0.005780 0.000235 0.063609 0.240268 0.000960 0.000366 -0.000437 0.003266 0.002169 0.025273 0.008165
qa: -0.2224 0.1702 -0.2367 0.1855 -0.0689 -0.0744 -0.2532 0.1662 0.1846 -0.2520 0.1611 0.1839 -0.2370 -0.0591 0.2255 0.1689 0.1667 0.2062 0.1846 0.2000 0.2004
va: 3.8686 0.9849 3.8874 0.9759 3.8047 3.7970 3.9231 0.9835 0.9758 3.8928 0.9810 0.9718 3.9010 3.7278 0.9599 0.9858 0.9831 0.9738 0.9742 0.9665 0.9768
energy: -311.880124650743
dipole: 0.56268 -0.74465 -0.18197 1.85503 -1.72013 0.13490 0.18512 -0.33477 -0.14965
magnitude: 0.27149 au
magnitude: 0.69008 debye
