program: Orca
programVersion: 5.0.3
elementType: C H C H C C C H H C H H C C H H H H H H H
charge: 1
multiplicity: 1
keywords: PBE0 cc-pVTZ EnGrad RIJCOSX verytightscf cc-pVTZ/C def2/J soscf
formula: C8H13
InChI: InChI=1/C8H13/c1-2-4-6-8-7-5-3-1/h1-2,7H,3-6,8H2
21 atoms
C  -2.003199 0.725466 0.070792
H  -2.173225 0.800575 1.148134
C  -1.740125 -0.97366 -0.169576
H  -2.623358 -1.360735 0.344301
C  -0.41009 -1.378937 0.382924
C  0.677257 -1.268637 -0.395251
C  1.990107 -0.704986 0.064527
H  2.189141 -0.922851 1.119156
H  2.849569 -1.038464 -0.524481
C  1.791501 0.832851 -0.127461
H  1.824413 1.096032 -1.190613
H  2.598821 1.381793 0.364622
C  0.432079 1.317396 0.498304
C  -0.760669 1.281263 -0.346726
H  0.515122 -1.188464 -1.474748
H  -1.829013 -1.139445 -1.244594
H  0.241413 0.841983 1.463027
H  -0.657927 1.636292 -1.376427
H  -2.875389 0.995032 -0.524717
H  0.540349 2.406638 0.7030
H  -0.319842 -1.45788 1.465636
totalener: -312.03823892 hartree
nucrepener: 379.04578622 hartree
electener: -691.08402514 hartree
oneelecener: -1159.13216895 hartree
twoeener: 468.04814380 hartree
kineticenergy: 309.64650342 hartree
exchangeener: -34.148187791060 hartree
correlationener: -1.959789710090 hartree
xcener: -36.107977501150 hartree
chargesum: 1.0000000
charge: -0.197855 0.175791 -0.178242 0.169008 -0.155639 -0.110836 -0.170034 0.135927 0.147631 -0.198113 0.136967 0.150919 -0.190621 0.101316 0.140246 0.164621 0.148650 0.207849 0.176187 0.186246 0.159985
charge: 0.128619 0.014798 0.163818 0.005087 0.023919 0.055724 0.070225 -0.002167 0.000227 0.108148 -0.008776 0.000411 0.082810 0.309515 -0.016200 -0.000802 0.007775 0.020574 0.006792 0.051778 -0.022275
qa: -0.1979 0.1758 -0.1782 0.1690 -0.1556 -0.1108 -0.1700 0.1359 0.1476 -0.1981 0.1370 0.1509 -0.1906 0.1013 0.1402 0.1646 0.1486 0.2078 0.1762 0.1862 0.1600
va: 3.8493 0.9826 3.8784 0.9797 3.8087 3.8371 3.8805 0.9948 0.9887 3.8696 0.9918 0.9855 3.8976 3.5595 0.9942 0.9842 1.0001 0.9711 0.9852 0.9781 0.9931
energy: -312.038238924985
dipole: 0.26227 -1.06153 -0.79926 1.91993 -0.66253 1.25740 0.25495 -0.38559 -0.13065
magnitude: 1.49564 au
magnitude: 3.80161 debye
