program: Orca
programVersion: 5.0.3
elementType: C H C H C C C H H C H H C C H H H H H H H
charge: 1
multiplicity: 1
keywords: DSD-PBEP86 cc-pVTZ EnGrad RIJCOSX verytightscf cc-pVTZ/C def2/J soscf
formula: C8H13
InChI: InChI=1/C8H13/c1-2-4-6-8-7-5-3-1/h1-2,7H,3-6,8H2
21 atoms
C  -1.998239 0.742476 0.075993
H  -2.187013 0.860334 1.146445
C  -1.745249 -0.942351 -0.148196
H  -2.6183 -1.33511 0.378062
C  -0.425845 -1.371154 0.402488
C  0.693614 -1.283771 -0.367554
C  2.006299 -0.687593 0.066811
H  2.218622 -0.878211 1.124557
H  2.85841 -1.026885 -0.526961
C  1.797075 0.886094 -0.145139
H  1.853523 1.130428 -1.211132
H  2.607235 1.421703 0.35499
C  0.422645 1.25692 0.457491
C  -0.757428 1.316809 -0.377942
H  0.529296 -1.213337 -1.447347
H  -1.843742 -1.123284 -1.219671
H  0.12287 0.321443 1.003508
H  -0.633967 1.432567 -1.458558
H  -2.873592 0.985213 -0.526488
H  0.397966 1.926235 1.332589
H  -0.34575 -1.511993 1.481843
totalener: -311.10413682 hartree
nucrepener: 380.47693999 hartree
electener: -691.58107680 hartree
oneelecener: -1161.24429202 hartree
twoeener: 469.66321522 hartree
kineticenergy: 309.69447670 hartree
exchangeener: -12.749035553267 hartree
correlationener: -0.944742115884 hartree
xcener: -13.693777669151 hartree
chargesum: 1.0000000
charge: -0.257966 0.194118 -0.260986 0.200350 -0.147890 -0.112463 -0.243589 0.160914 0.178572 -0.268516 0.165311 0.182797 -0.231961 0.089117 0.170367 0.188748 0.148543 0.218289 0.203141 0.230838 0.192265
charge: 0.124078 0.010349 0.152393 0.009143 0.025525 0.089265 0.081139 -0.004503 -0.003034 0.107716 -0.011392 -0.001429 0.082076 0.295102 -0.014805 -0.001435 0.014121 0.013978 0.008240 0.038133 -0.014660
qa: -0.2580 0.1941 -0.2610 0.2003 -0.1479 -0.1125 -0.2436 0.1609 0.1786 -0.2685 0.1653 0.1828 -0.2320 0.0891 0.1704 0.1887 0.1485 0.2183 0.2031 0.2308 0.1923
va: 3.8890 0.9734 3.9299 0.9660 3.8268 3.8408 3.9059 0.9854 0.9747 3.9042 0.9833 0.9757 3.8533 3.6028 0.9808 0.9735 1.0378 0.9641 0.9696 0.9637 0.9801
energy: -311.812640452011
dipole: 0.08020 -0.83578 -0.75558 0.92736 -0.04820 0.87916 0.40488 -0.46242 -0.05754
magnitude: 1.16067 au
magnitude: 2.95018 debye
