program: Orca
programVersion: 5.0.3
elementType: C H C H C C C H H C H H C C H H H H H H H
charge: 1
multiplicity: 1
keywords: m062x def2-TZVP EnGrad RIJCOSX verytightscf def2/J soscf
formula: C8H13
InChI: InChI=1/C8H13/c1-3-7-5-2-6-8(4-1)9-7/h3,6-8H,1-2,4-5H2
21 atoms
C  -1.994296 0.669128 0.105222
H  -2.185346 0.860704 1.165575
C  -1.8278 -0.933314 -0.13058
H  -2.64357 -1.435579 0.392365
C  -0.455836 -1.336003 0.393402
C  0.686976 -1.270725 -0.368466
C  1.997017 -0.668366 0.094032
H  2.192532 -0.869977 1.151718
H  2.849567 -1.011363 -0.494911
C  1.830081 0.932939 -0.12911
H  1.917319 1.155127 -1.197418
H  2.643468 1.435576 0.397287
C  0.455178 1.323709 0.40014
C  -0.691009 1.282039 -0.358593
H  0.541946 -1.247483 -1.452347
H  -1.917297 -1.1457 -1.200654
H  0.002499 -0.000942 0.113958
H  -0.553967 1.284081 -1.443559
H  -2.852067 1.011538 -0.476393
H  0.346666 1.336293 1.487629
H  -0.345871 -1.371248 1.480247
totalener: -312.25143192 hartree
nucrepener: 382.86013937 hartree
electener: -695.11157130 hartree
oneelecener: -1166.00947515 hartree
twoeener: 470.89790386 hartree
kineticenergy: 310.36038733 hartree
xcener: -23.104449536543 hartree
chargesum: 1.0000000
charge: -0.313091 0.206309 -0.329843 0.207751 -0.108661 -0.073776 -0.313235 0.205810 0.206604 -0.330274 0.208693 0.207646 -0.110375 -0.073445 0.193660 0.209100 0.196243 0.193300 0.206527 0.206162 0.204895
charge: -0.202946 0.157206 -0.201171 0.159884 -0.131276 -0.096857 -0.203127 0.157058 0.159988 -0.201394 0.156757 0.159713 -0.133816 -0.094878 0.167960 0.156889 0.326480 0.167618 0.160064 0.168092 0.167757
qa: -0.3131 0.2063 -0.3298 0.2078 -0.1087 -0.0738 -0.3132 0.2058 0.2066 -0.3303 0.2087 0.2076 -0.1104 -0.0734 0.1937 0.2091 0.1962 0.1933 0.2065 0.2062 0.2049
va: 3.7450 0.9487 3.7689 0.9566 3.6268 3.6784 3.7458 0.9488 0.9562 3.7700 0.9474 0.9567 3.6220 3.6839 0.9499 0.9472 0.9339 0.9501 0.9561 0.9481 0.9488
energy: -312.251431923162
dipole: -0.00382 -0.00209 -0.00591 0.00164 -0.00337 -0.00173 -0.07127 0.05731 -0.01396
magnitude: 0.01526 au
magnitude: 0.03879 debye
