program: Gaussian 09
title: 000051190
version: EM64L-G09RevD.01
frameworkgroup: C1[X(C16H22N2O2)]
method: RPBEPBE
basis: SDD
operation: Freq
keyword: #p
keyword: freq=noraman
keyword: PBEPBE/SDD
title: #p freq=noraman PBEPBE/SDD
converged: NO YES NO NO
title: Mulliken charges:
elementType: O O N N C C C C C C C C C C C C C C C C H H H H H H H H H H H H H H H H H H H H H H
charge: -0.290137 -0.264766 -0.066176 -0.105165 -0.083708 -0.083507 -0.489104 -0.423418 -0.403922 -0.426660 -0.422648 -0.610313 0.127425 0.255654 -0.367103 -0.350049 -0.356178 -0.368158 0.322963 -0.537581 0.203147 0.205909 0.217127 0.220102 0.184696 0.213098 0.220483 0.178405 0.248397 0.222203 0.213296 0.260964 0.213688 0.190583 0.230941 0.261140 0.283206 0.250567 0.238253 0.245602 0.218837 0.221906
chargesum: 0.00000
title: Mulliken charges with hydrogens summed into heavy atoms:
elementType: O O N N C C C C C C C C C C C C C C C C
charge: -0.290137 -0.264766 -0.066176 -0.105165 0.119439 0.122402 -0.051875 -0.025623 -0.005034 0.043940 0.051612 0.024899 0.127425 0.255654 -0.105963 -0.066843 -0.105611 -0.129905 0.322963 0.148764
polarizability: 2.51058288e+02 1.20519383e+01 1.87539971e+02 1.01004129e+00 4.92425545e+00 1.37906465e+02
1716.lowfreq: -11.8454 0.0000 0.0007 0.0009 6.7686 10.4852 40.2582 45.4428 50.3984
frequency: 38.5352 45.3646 50.2134 61.5044 106.4222 124.7791 130.8403 164.8291 194.3697 227.3369 239.0553 251.4662 257.6474 284.4336 303.0894 310.3206 325.0292 344.2076 363.1577 374.5351 401.0628 419.9158 429.2802 462.9063 482.5382 507.7684 547.1540 584.5643 624.4797 656.8523 673.4162 700.4134 738.5393 753.7967 775.1481 804.0098 811.9830 824.2210 844.9421 880.3829 895.4403 914.2431 922.0046 961.0257 964.1645 974.5659 980.7842 982.3817 989.5686 992.4951 1006.5376 1055.8711 1070.1581 1097.7101 1105.7613 1109.4167 1113.2766 1120.7689 1125.8749 1130.9153 1150.0139 1155.9865 1157.9405 1176.1400 1199.0595 1227.0585 1242.2841 1253.1179 1261.0703 1274.6714 1294.0244 1300.5994 1319.4382 1323.9600 1329.7476 1338.8908 1356.1205 1362.6333 1367.7601 1369.2747 1378.3328 1406.5214 1417.9187 1431.8088 1437.0325 1457.1737 1462.2275 1463.7203 1466.7193 1470.5469 1473.3275 1478.2019 1482.6777 1485.3806 1498.8871 1542.6248 1578.7821 1616.4712 2800.1040 2812.6116 2850.1599 2916.2297 2936.2896 2958.3331 2972.8971 2990.2882 3002.4863 3006.3417 3011.1847 3013.3096 3035.4758 3045.7802 3071.9872 3073.3542 3084.3839 3122.9442 3124.4116 3147.9615 3155.5180 3170.7375
redmass: 4.5064 3.7375 4.2451 5.0361 3.4679 2.8175 3.8082 3.4477 2.4256 1.1710 1.7280 3.0924 2.5650 4.2669 3.4015 3.4002 2.5388 2.6482 2.4879 2.0997 2.9383 2.9103 2.5515 4.1879 3.5549 2.6930 4.1431 4.3800 6.7388 4.8960 4.7300 5.6764 4.6723 4.5955 4.9709 3.4693 2.6568 1.3082 1.6802 3.0517 1.5892 1.5733 2.5609 1.8998 1.4145 1.6134 1.7459 2.4619 5.6315 3.2244 2.5890 1.6254 2.0234 1.2535 1.4322 1.4157 1.2617 1.4260 1.5395 1.5448 2.3663 1.4459 1.8089 1.2474 1.1364 3.1163 1.9477 1.8889 1.5805 2.1673 1.7339 1.2751 2.0999 1.4019 1.4227 1.7977 1.4450 1.3777 1.5082 4.1781 1.3917 2.9390 3.6789 1.1770 1.1847 1.0761 1.0796 1.0755 1.0504 1.0943 1.0731 1.0875 1.0661 1.0951 2.4984 8.9514 7.6074 6.2002 1.0718 1.0704 1.0574 1.0720 1.0705 1.0330 1.0613 1.0862 1.0850 1.0852 1.0727 1.0863 1.1032 1.1038 1.1004 1.0909 1.0890 1.0929 1.0963 1.0883 1.0936 1.0970
irintensity: 1.0993 1.2546 0.1928 1.6636 1.7721 1.0157 6.7014 0.6430 1.4324 0.0702 0.6935 5.1316 1.4079 2.5190 17.1496 5.4012 0.5543 1.9446 1.0409 1.5529 0.0821 0.1784 1.7331 0.2413 3.7066 7.8077 9.3377 36.5519 4.2898 1.1284 0.8934 12.1050 9.5142 9.9394 4.1123 13.8730 1.4861 9.9921 60.6711 5.0254 10.6538 1.6284 2.9564 0.6253 0.1350 12.8544 9.2921 20.6031 29.1736 28.4044 6.3315 10.1444 31.3218 0.7624 23.5908 1.3062 0.2658 4.1747 14.9294 2.8765 25.8140 4.0949 4.3402 99.6229 0.1879 160.9245 82.5178 88.7071 27.9132 7.9583 11.1392 0.0571 52.0409 1.3422 2.4941 28.0654 2.6716 2.3863 5.3912 3.5020 1.9528 182.4723 50.7836 2.4861 1.8536 31.2239 6.2709 2.1007 13.6680 15.5972 33.0833 23.7763 22.8203 5.3233 47.5424 209.6380 45.2571 118.0255 64.9765 153.0061 238.0124 54.6730 68.7956 65.0634 30.9140 41.7033 79.3190 100.5935 39.4529 18.6623 46.1129 49.2899 24.6999 14.3842 11.8291 8.1111 20.5275 3.2419 13.4729 8.9152
temp: 298.150 k
press: 1.00000 atm
elementType: 8 8 7 7 6 6 6 6 6 6 6 6 6 6 6 6 6 6 6 6 1 1 1 1 1 1 1 1 1 1 1 1 1 1 1 1 1 1 1 1 1 1
symmnumber: 1
zpe: 932754.7 jmol-1
zpe.correction: 0.355268 hartree
zpe.thermalcorrener: 0.373556 hartree
zpe.thermalcorrenthalpy: 0.374500 hartree
zpe.thermalcorrgfe: 0.309027 hartree
zpe.sumelectzpe: -881.319063 hartree
zpe.sumelectthermal: -881.300774 hartree
zpe.sumelectthermalent: -881.299830 hartree
zpe.sumelectthermalfe: -881.365303 hartree
dipole: -1.8977 5.2476 2.7805
dipole: 6.2346
quadrupole: -105.5990 -118.6803 -122.2971
quadrupole: 8.3872 -0.6660 -7.6636
quadrupole: 9.9265 -3.1549 -6.7716 8.3872 -0.6660 -7.6636
hfenergy: -881.67433 hartree
pointgroup: C01 [X(C16H22N2O2)]
dipole: -0.7723593 2.0653903 1.0743324 debye
polarizability: 249.6317973|14.8273249|188.9116878|-5.9750354|2.516791|137.9612385 unknown
InChI: InChI=1S/C16H22N2O2/c1-17-8-12-7-13(9-17)11-18(10-12)16(19)14-3-5-15(20-2)6-4-14/h3-6,12-13H,7-11H2,1-2H3
charge 0 multiplicity 1
42 atoms
O  -0.315577 -2.632685 -1.237486
O  5.016136 0.685308 -0.043654
N  -2.199636 1.414394 -0.56464
N  -1.282862 -1.242335 0.359665
C  -2.292317 0.584203 1.797989
C  -3.670919 -0.550871 0.070797
C  -3.685004 -0.033166 1.528683
C  -2.106604 1.800911 0.860683
C  -3.421657 0.638681 -0.89132
C  -1.202183 -0.510666 1.642822
C  -2.629566 -1.691885 -0.04859
C  -2.019465 2.56056 -1.473001
C  -0.190581 -1.699031 -0.373429
C  1.142576 -1.026181 -0.181632
C  2.316869 -1.820091 -0.092713
C  1.273418 0.381702 -0.257198
C  3.58597 -1.221603 -0.034288
C  2.544491 0.997787 -0.221946
C  3.703814 0.191259 -0.098084
C  5.200042 2.134119 -0.144723
H  -2.2350 0.95077 2.842218
H  -4.657701 -0.983335 -0.18791
H  -3.890065 -0.863907 2.232112
H  -4.478029 0.726756 1.670577
H  -2.881336 2.568721 1.134136
H  -1.116719 2.270513 1.028913
H  -3.323125 0.27019 -1.930673
H  -4.332724 1.297091 -0.860027
H  -0.195218 -0.080068 1.752939
H  -1.34036 -1.238916 2.474703
H  -2.960532 -2.541677 0.588832
H  -2.547272 -2.074023 -1.079365
H  -1.061298 3.068203 -1.256127
H  -2.837012 3.322679 -1.388789
H  -1.989565 2.206749 -2.519107
H  2.219767 -2.910636 -0.088467
H  0.367858 0.985144 -0.393762
H  4.498514 -1.820245 0.043629
H  2.618467 2.086606 -0.304147
H  6.287069 2.290911 -0.08438
H  4.700237 2.663879 0.689866
H  4.820498 2.522088 -1.110204
