program: Orca
programVersion: 5.0.3
charge: 1
multiplicity: 1
keywords: DLPNO-CCSD(T1) tightPNO Extrapolate(3/4,def2) RIJK def2/JK verytightSCF miniprint nopop
formula: C8H13
InChI: InChI=1/C8H13/c1-2-4-6-8-7-5-3-1/h1-2,7H,3-6,8H2
21 atoms
C  -1.992965 0.517875 0.075766
H  -2.193824 0.779757 1.117906
C  -1.999809 -1.021937 -0.124688
H  -2.681499 -1.581882 0.516136
C  -0.543508 -1.086389 0.288776
C  0.573752 -1.059823 -0.527722
C  1.900858 -0.628323 0.020647
H  2.018429 -0.994657 1.046199
H  2.721031 -1.02656 -0.582071
C  1.936222 0.938664 0.018222
H  2.139529 1.294391 -0.998033
H  2.751163 1.292336 0.655027
C  0.569028 1.469915 0.48905
C  -0.49278 0.708694 -0.260575
H  0.472741 -1.27139 -1.591234
H  -2.155072 -1.306424 -1.168985
H  0.436809 1.3737 1.572122
H  -0.370839 0.80241 -1.343087
H  -2.650465 1.093627 -0.580758
H  0.470831 2.535762 0.241206
H  -0.367026 -1.031806 1.363633
e0: -310.329669185 hartree
corrType: DLPNO BASED
e0: -310.343284743 hartree
basis: def2-TZVPP def2-QZVPP
scfener: -310.329669185 -310.343284743
corrmethod: MDCI MDCI
correner: -1.452713552 -1.522836461
corrcbsextra: -1.574779318
energy: -311.919939450920
dipole: 0.55460 -0.71639 -0.16179 1.83397 -1.99857 -0.16460 0.23233 -0.44202 -0.20969
magnitude: 0.31183 au
magnitude: 0.79262 debye
