program: Gaussian 09
title: 000051132
version: EM64L-G09RevD.01
frameworkgroup: C1[X(C6H12O3)]
method: RPBEPBE
basis: SDD
operation: Freq
keyword: #pfreq=noraman
keyword: PBEPBE/SDD
title: #p freq=noraman PBEPBE/SDD
converged: YES YES NO NO
title: Mulliken charges:
elementType: O O O C C C C C C H H H H H H H H H H H H
charge: -0.274077 -0.257499 -0.253367 0.016002 -0.277076 -0.704069 -0.508162 0.300228 -0.753058 0.175756 0.217972 0.255250 0.215076 0.213379 0.255230 0.193984 0.235732 0.208770 0.244997 0.251388 0.243543
chargesum: 0.00000
title: Mulliken charges with hydrogens summed into heavy atoms:
elementType: O O O C C C C C C
charge: -0.274077 -0.257499 -0.253367 0.191757 0.196147 -0.020384 0.130323 0.300228 -0.013130
polarizability: 9.29891739e+01 -4.26107734e-01 6.95141753e+01 7.79874639e-02 -2.95255362e+00 6.54538138e+01
1716.lowfreq: -8.4680 -0.0015 -0.0011 -0.0008 1.6349 7.1329 18.7405 30.2071 58.8863
frequency: 15.7706 29.8478 58.8421 71.1818 140.1094 177.1062 190.9540 227.2381 240.5438 286.3012 348.2852 393.4393 442.7028 564.7293 581.6885 620.2386 754.9461 840.7216 880.4830 910.7402 962.6502 999.8881 1026.2937 1043.7770 1058.8531 1101.7182 1112.9095 1152.4601 1158.5519 1207.3290 1236.2572 1319.8457 1345.8800 1359.4594 1382.8616 1386.7860 1434.7564 1451.2124 1453.9131 1455.4351 1457.1736 1466.8095 1479.2942 1484.4241 1646.6496 2903.7442 2926.7180 2994.4618 3006.7504 3008.7601 3017.1213 3081.7558 3088.3946 3099.7557 3099.7767 3113.4965 3139.6008
redmass: 1.3872 2.4298 3.2526 2.4321 2.9214 3.4207 1.1604 3.7162 1.2975 2.7022 2.0908 3.0168 2.9582 3.2337 4.1219 3.4466 3.1501 3.6639 2.6566 2.1673 2.4670 1.8258 4.4358 1.6541 1.8523 2.0794 1.2850 1.9704 1.4390 3.7038 1.1279 1.2713 1.5392 1.4723 1.2373 1.2569 1.1310 1.0672 1.0624 1.0529 1.0621 1.0537 1.0584 1.0539 9.4960 1.0820 1.0369 1.0378 1.0378 1.0978 1.0585 1.0986 1.1058 1.0964 1.0957 1.0999 1.1022
irintensity: 0.8004 0.2837 2.3479 7.7298 2.1986 3.6649 1.9541 7.6687 1.5281 4.2970 1.9967 6.2128 7.6066 3.3054 6.1914 1.8137 10.4648 11.6831 4.2483 9.6780 54.0218 86.4965 53.5593 12.7746 25.6977 38.3024 1.0638 21.6559 13.8950 363.4055 11.9390 14.2376 11.2759 3.5334 40.7285 40.6053 1.4098 8.9802 24.2562 14.9924 20.0544 9.7784 12.0831 8.2313 210.2309 60.6077 86.3520 15.8822 1.8688 72.8711 24.4544 32.2815 25.5654 7.3725 28.7869 21.6894 10.3169
temp: 298.150 k
press: 1.00000 atm
elementType: 8 8 8 6 6 6 6 6 6 1 1 1 1 1 1 1 1 1 1 1 1
symmnumber: 1
zpe: 457221.1 jmol-1
zpe.correction: 0.174146 hartree
zpe.thermalcorrener: 0.185768 hartree
zpe.thermalcorrenthalpy: 0.186712 hartree
zpe.thermalcorrgfe: 0.134253 hartree
zpe.sumelectzpe: -460.747374 hartree
zpe.sumelectthermal: -460.735752 hartree
zpe.sumelectthermalent: -460.734808 hartree
zpe.sumelectthermalfe: -460.787267 hartree
dipole: -2.4949 1.6838 0.8306
dipole: 3.1224
quadrupole: -50.1574 -56.4374 -53.4446
quadrupole: 7.6961 -3.6670 -0.6664
quadrupole: 3.1891 -3.0910 -0.0981 7.6961 -3.6670 -0.6664
hfenergy: -460.9215199 hartree
pointgroup: C01 [X(C6H12O3)]
dipole: -0.9905779 0.0867771 0.7213378 debye
dipolederiv: -0.8639042 0.228047 -0.1336688 0.312316 -0.5636264 0.0927825 -0.1695679 0.0734715 -0.5427306 -1.6389689 -0.2166837 0.1334054 -0.2514069 -0.4652572 -0.0862548 0.1287532 -0.0992713 -0.3505651 -0.816899 -0.012367 0.0834671 0.2991183 -0.6513369 -0.2791165 0.3090066 -0.2152355 -0.5201018 0.4343213 -0.1122915 0.1133892 -0.2591811 0.5824486 -0.1068692 0.2398287 -0.0990397 0.523737 0.5863733 0.1791789 0.0264593 0.3433829 0.3612721 -0.0004679 0.1717325 0.0009106 0.2286229 -0.0095025 0.009436 0.0136043 0.0657234 -0.0134386 -0.023223 -0.0409243 0.0130368 -0.2240387 0.6898311 -0.1310785 0.0967914 -0.0263661 0.296579 0.0685435 -0.0109416 0.0825442 0.2874921 1.9097312 0.1984889 -0.201128 -0.1034729 0.8595637 0.44483 -0.4539457 0.3694449 0.5152766 -0.1438469 -0.1401207 -0.045061 -0.2052491 -0.2862541 -0.1365335 -0.0390627 -0.0902313 -0.0112376 -0.0822497 -0.129687 -0.0541892 -0.0222544 -0.1824093 -0.031695 -0.0669165 -0.0597542 -0.0254799 -0.0325041 0.0429794 -0.0369708 -0.0472638 -0.105819 0.0386572 -0.0726975 0.0627389 0.0571887 0.020725 -0.0333633 0.0369768 -0.0985377 0.0561208 0.0244087 -0.0320089 -0.0239832 -0.0928643 -0.1718326 0.00981 0.098534 0.0139755 0.0987763 -0.0332501 0.0692155 -0.0160219 0.0619702 0.0660417 0.0918042 -0.0680701 0.0858551 -0.0587234 0.1016757 -0.0695909 0.0797623 0.0200381 0.0907662 -0.0782966 -0.04013 -0.0834854 -0.0357553 -0.0706085 -0.0252532 -0.0296945 0.0690272 -0.106712 -0.0416767 -0.0425174 -0.181346 -0.1343042 -0.0842488 -0.008437 -0.055498 0.0653099 0.033368 0.0507415 -0.0359624 0.0830438 -0.0176044 0.1184115 -0.0718948 0.1251682 -0.0089382 -0.0591494 0.0504555 0.037531 0.0163879 0.0531697 -0.0745555 0.1391828 -0.1146702 -0.1483329 0.0778205 0.0041646 0.0881907 0.009394 0.1155605 -0.0300218 0.0490649 -0.0659385 -0.0504778 0.1090508 0.0104354 -0.0393316 -0.0076732 0.0007866 0.0731854 -0.0238714 0.0936266 0.0348645 -0.0924601 0.0200237 -0.03132 0.0570396 0.0902517 -0.0056499 -0.0216718 -0.0313657 0.1112396 unknown
polarizability: 92.9969385|0.0967991|69.5008285|-0.0868707|2.9544143|65.459396 unknown
InChI: InChI=1S/C6H12O3/c1-5(8-3)4-9-6(2)7/h5H,4H2,1-3H3
charge 0 multiplicity 1
21 atoms
O  -1.998756 0.518211 -0.682098
O  0.80783 0.193743 0.245397
O  2.647993 -0.78778 -0.793165
C  -1.497182 -0.628553 0.098299
C  -0.058053 -0.852195 -0.363213
C  -1.629426 -0.423706 1.61932
C  -3.443662 0.712217 -0.586928
C  2.16622 0.118359 -0.07514
C  2.923151 1.276508 0.538205
H  -2.070018 -1.538561 -0.204532
H  0.311776 -1.845085 -0.047988
H  0.008544 -0.776706 -1.462186
H  -2.688394 -0.358084 1.924808
H  -1.174914 -1.272807 2.162399
H  -1.109517 0.499611 1.921739
H  -3.998349 -0.219368 -0.835357
H  -3.691346 1.489913 -1.326758
H  -3.757981 1.058895 0.418516
H  2.506639 1.542922 1.522357
H  2.830322 2.161496 -0.117414
H  3.988723 1.017171 0.626639
