program: Gaussian 09
title: 000051168
version: EM64L-G09RevD.01
frameworkgroup: C1[X(C14H13NO)]
method: RPBEPBE
basis: SDD
operation: Freq
keyword: #p
keyword: freq=noraman
keyword: PBEPBE/SDD
title: #p freq=noraman PBEPBE/SDD
converged: YES YES NO NO
title: Mulliken charges:
elementType: O N C C C C C C C C C C C C C C H H H H H H H H H H H H H
charge: -0.233377 0.011386 0.209775 0.342781 0.263934 -0.591840 0.407843 -0.355431 -0.379960 -0.041301 -0.310227 -0.375400 -0.829492 -0.249527 -0.795535 -0.233962 0.262717 0.246171 0.251389 0.272150 0.232906 0.231843 0.247208 0.233526 0.232567 0.249809 0.251626 0.216413 0.232007
chargesum: 0.00000
title: Mulliken charges with hydrogens summed into heavy atoms:
elementType: O N C C C C C C C C C C C C C C
charge: -0.233377 0.011386 0.209775 0.342781 0.263934 -0.329123 0.407843 -0.109259 -0.128571 -0.041301 -0.038077 -0.142494 -0.116916 -0.016960 -0.077686 -0.001955
polarizability: 2.93985203e+02 -1.23503158e+01 1.59597765e+02 -1.24272593e+00 2.30519719e-02 8.85803268e+01
1716.lowfreq: -8.0743 -5.7013 -0.0008 0.0003 0.0009 0.9370 39.0786 46.7380 56.9268
frequency: 38.8708 46.7339 56.9063 81.1949 134.4741 153.1918 171.0418 183.1953 209.3585 223.6476 260.8495 281.6641 337.1808 375.3340 413.2828 446.3848 456.4330 500.0893 522.7309 545.6008 559.7831 606.5877 633.0463 681.7302 728.8730 743.0720 769.7141 780.3660 789.8657 856.9363 872.6852 881.5088 903.6166 953.3163 984.8305 986.9410 990.6905 993.9897 1032.6771 1041.4029 1043.7131 1054.9905 1086.0319 1119.0659 1174.7540 1177.7771 1178.1598 1208.4221 1261.8752 1278.2623 1303.0071 1326.9425 1359.5513 1376.5505 1398.9219 1401.5110 1413.5759 1428.5228 1456.7335 1463.0424 1469.6879 1474.8817 1476.1839 1493.3955 1559.5253 1578.3815 1604.2572 1609.8781 2978.2468 2997.0066 3059.1233 3082.6153 3094.5797 3098.0093 3120.4950 3129.2678 3134.4860 3140.8160 3144.3198 3163.5229 3164.4652
redmass: 1.0996 4.4512 4.2363 4.7048 6.2393 1.0366 4.1703 3.6835 4.7864 4.2003 5.4808 3.5116 4.6538 3.5676 3.4341 3.0648 2.9481 4.5752 4.9239 5.1482 4.4531 3.5749 6.5049 6.1548 3.0296 2.2359 1.6463 5.2925 5.4257 1.3939 1.4515 3.7134 1.3646 1.3838 1.4725 1.7950 1.3352 1.3528 2.4712 1.5570 1.5786 2.1606 3.0502 1.7121 1.6387 1.2520 1.8234 2.3222 1.8076 1.4623 1.9596 8.0565 6.4529 8.0530 1.3624 1.2180 2.5208 2.0884 1.0493 2.3319 1.2886 1.0971 1.2022 2.2003 7.0020 6.4321 6.0456 6.2092 1.0404 1.0364 1.0935 1.0965 1.0995 1.1009 1.0868 1.0887 1.0908 1.0871 1.0939 1.0963 1.1009
irintensity: 0.5172 1.4089 0.7617 0.5246 0.7335 0.8530 0.2002 4.4621 3.0296 0.6002 3.6282 1.4586 0.2698 4.5497 0.8718 7.2380 7.2782 0.6069 0.3455 0.3557 1.1857 0.8957 0.1093 15.9392 5.3969 17.4691 67.6204 11.1604 27.9019 32.9892 4.9047 12.0699 7.8560 0.3266 1.3910 0.5314 0.2035 0.3577 20.3969 8.9660 10.7248 2.1312 96.0321 8.1812 128.1494 40.7175 4.3617 0.2215 90.9808 2.9032 43.0607 171.4066 9.1383 7.6565 31.8326 16.7138 7.6712 1.8570 13.4399 15.3243 16.6551 18.2567 44.2257 3.1718 13.8438 2.0706 160.4660 19.1321 20.9954 16.5780 21.2980 9.2068 15.7684 14.3285 10.3559 5.6627 6.2415 0.4322 27.1485 9.3502 35.0127
temp: 298.150 k
press: 1.00000 atm
elementType: 8 7 6 6 6 6 6 6 6 6 6 6 6 6 6 6 1 1 1 1 1 1 1 1 1 1 1 1 1
symmnumber: 1
zpe: 600013.1 jmol-1
zpe.correction: 0.228533 hartree
zpe.thermalcorrener: 0.243173 hartree
zpe.thermalcorrenthalpy: 0.244118 hartree
zpe.thermalcorrgfe: 0.186042 hartree
zpe.sumelectzpe: -670.081173 hartree
zpe.sumelectthermal: -670.066532 hartree
zpe.sumelectthermalent: -670.065588 hartree
zpe.sumelectthermalfe: -670.123664 hartree
dipole: -5.2683 0.9410 0.6288
dipole: 5.3885
quadrupole: -110.2269 -84.2465 -94.9873
quadrupole: 7.2622 2.4202 -1.3085
quadrupole: -13.7400 12.2404 1.4996 7.2622 2.4202 -1.3085
hfenergy: -670.3097058 hartree
pointgroup: C01 [X(C14H13N1O1)]
dipole: -2.0760995 0.1840789 0.3877292 debye
polarizability: 294.4006103|-6.055045|149.1798853|-8.4611012|24.412471|98.5827995 unknown
InChI: InChI=1S/C14H13NO/c1-10-5-3-4-6-13(10)12-7-8-14(15-16)11(2)9-12/h3-9H,1-2H3
charge 0 multiplicity 1
29 atoms
O  4.791796 -0.839757 -0.910115
N  4.225719 -0.006392 -0.104356
C  -1.553026 0.058557 0.03477
C  -0.062568 -0.01355 -0.005097
C  -2.390565 -1.102609 0.102399
C  0.7105 0.856794 0.814184
C  2.122971 0.862563 0.792388
C  0.622771 -0.904841 -0.886504
C  -2.159248 1.348056 0.010697
C  2.774051 -0.045288 -0.103245
C  2.02073 -0.918083 -0.937605
C  -3.797138 -0.918304 0.129636
C  -1.846326 -2.521136 0.194007
C  -3.558254 1.50787 0.028425
C  2.910479 1.791755 1.695067
C  -4.38564 0.363555 0.085069
H  0.191496 1.528574 1.507567
H  0.043787 -1.55417 -1.550112
H  -1.51553 2.232246 -0.058477
H  2.567581 -1.581675 -1.616885
H  -4.440435 -1.804092 0.197492
H  -1.707465 -2.971076 -0.808137
H  -0.87204 -2.564702 0.708685
H  -2.553235 -3.168168 0.741962
H  -3.997065 2.510688 -0.007296
H  3.548345 1.223365 2.394648
H  3.592509 2.434341 1.112283
H  2.231111 2.433256 2.281316
H  -5.47611 0.467822 0.102931
