program: Orca
programVersion: 5.0.3
elementType: C H C H C C C H H C H H C C H H H H H H H
charge: 1
multiplicity: 1
keywords: DSD-PBEP86 def2-TZVP D3BJ RIJCOSX verytightscf def2-TZVP/C def2/J soscf noTRAH
formula: C8H13
InChI: InChI=1/C8H13/c1-2-4-6-8-7-5-3-1/h1-2,7H,3-6,8H2
21 atoms
C  -1.989882 0.570377 0.098425
H  -2.166428 0.750751 1.164138
C  -1.856434 -0.968164 -0.174319
H  -2.659115 -1.515186 0.327632
C  -0.457667 -1.27734 0.335576
C  0.640117 -1.218003 -0.455802
C  1.932067 -0.688076 0.072655
H  2.081688 -0.945664 1.126391
H  2.800774 -1.037109 -0.495145
C  1.836258 0.864184 -0.087615
H  1.890204 1.127564 -1.150514
H  2.679537 1.354744 0.406856
C  0.503952 1.444671 0.511421
C  -0.653613 1.103219 -0.313295
H  0.528773 -1.28962 -1.538805
H  -1.923998 -1.164912 -1.249196
H  0.363283 1.170667 1.560233
H  -0.541197 1.324252 -1.379392
H  -2.800597 1.013871 -0.490465
H  0.61822 2.545558 0.456769
H  -0.326943 -1.282509 1.419113
totalener: -311.13308996 hartree
nucrepener: 381.07291857 hartree
electener: -692.20600853 hartree
oneelecener: -1162.54241049 hartree
twoeener: 470.33640196 hartree
kineticenergy: 310.01148463 hartree
exchangeener: -13.668546189409 hartree
correlationener: -0.922712696382 hartree
xcener: -14.591258885791 hartree
chargesum: 1.0000000
charge: -0.204406 0.172042 -0.207017 0.176449 -0.145332 -0.137928 -0.218327 0.155962 0.167511 -0.241141 0.150257 0.173796 -0.176313 0.083733 0.169633 0.163870 0.161296 0.208409 0.181372 0.200348 0.165787
charge: -0.195858 0.159908 -0.193830 0.150599 -0.100189 -0.120314 -0.218764 0.150808 0.154230 -0.197703 0.144874 0.150395 -0.215361 0.183912 0.155479 0.152664 0.157257 0.174270 0.160356 0.191733 0.155535
qa: -0.2044 0.1720 -0.2070 0.1764 -0.1453 -0.1379 -0.2183 0.1560 0.1675 -0.2411 0.1503 0.1738 -0.1763 0.0837 0.1696 0.1639 0.1613 0.2084 0.1814 0.2003 0.1658
va: 3.8423 0.9684 3.8536 0.9693 3.8693 3.8561 3.8971 0.9719 0.9710 3.8705 0.9713 0.9633 3.8728 3.5372 0.9626 0.9733 0.9751 0.9409 0.9684 0.9575 0.9641
total: -311.803733483 hartree
dispcorr: -0.011927955 hartree
energy: -311.815661438021
dipole: 0.50993 -1.01066 -0.50074 1.92134 -0.89362 1.02772 0.14750 -0.32102 -0.17352
magnitude: 1.15631 au
magnitude: 2.93911 debye
