program: Gaussian 09
title: 000051244
version: EM64L-G09RevD.01
frameworkgroup: C1[X(C19H23N5OS)]
method: RPBEPBE
basis: SDD
operation: Freq
keyword: #p
keyword: freq=noraman
keyword: PBEPBE/SDD
title: #p freq=noraman PBEPBE/SDD
converged: YES YES NO NO
title: Mulliken charges:
elementType: S O N N N N N C C C C C C C C C C C C C C C C C C C H H H H H H H H H H H H H H H H H H H H H H H
charge: 0.248675 -0.263696 -0.117076 -0.504009 -0.387718 -0.065603 -0.157133 0.175603 -0.694684 -0.693338 -0.700679 0.226770 0.387570 0.195994 -0.057892 -0.448442 -0.326921 0.077840 -0.318961 -0.300728 -0.233153 -0.104213 -0.222537 -0.684749 -0.496739 -0.119997 0.219130 0.189901 0.242197 0.227379 0.229463 0.192413 0.184287 0.224832 0.243919 0.401754 0.332424 0.231888 0.326787 0.255873 0.221255 0.226380 0.220746 0.220366 0.204692 0.226893 0.226649 0.274406 0.262181
chargesum: 0.00000
title: Mulliken charges with hydrogens summed into heavy atoms:
elementType: S O N N N N N C C C C C C C C C C C C C C C C C C C
charge: 0.248675 -0.263696 -0.117076 -0.102255 -0.060930 -0.065603 -0.157133 0.175603 -0.043456 -0.044083 -0.047641 0.226770 0.387570 0.195994 -0.057892 -0.116018 -0.095034 0.077840 -0.063089 -0.079472 -0.006773 -0.104213 0.218574 -0.026514 -0.222334 0.142183
polarizability: 3.72411833e+02 1.95230584e+01 3.68537948e+02 -2.38577823e-01 -4.66424502e-01 1.31780162e+02
1716.lowfreq: -11.1972 0.0012 0.0016 0.0022 2.7949 5.2046 8.1967 15.9019 34.9162
frequency: -7.0187 15.8952 34.8922 45.7246 54.1880 55.2693 77.0322 83.0961 96.1598 108.8865 116.6292 147.5859 160.1889 177.8330 187.0312 191.6827 210.6056 220.7189 235.7810 251.1056 258.4239 268.8662 270.3366 299.6889 317.8085 334.6913 359.2790 371.8085 415.5335 435.3234 444.2958 464.8584 480.5203 489.4975 519.8717 523.2273 533.6772 538.1790 548.1937 586.3901 601.2425 636.9639 637.7031 663.8623 675.8183 684.2638 692.0807 698.2905 728.0182 762.9777 777.1803 782.6057 802.3979 806.6800 816.6313 846.6044 855.2287 856.3067 865.4166 885.5004 890.0806 899.7784 913.2504 925.2688 944.4529 956.2816 964.9612 986.7799 994.1475 1018.3256 1025.1223 1029.2978 1038.5167 1040.5907 1077.0555 1104.0308 1112.5597 1135.9998 1136.9289 1161.7568 1181.7038 1190.8319 1214.4510 1217.6727 1239.1355 1244.0841 1250.6894 1272.4038 1280.3572 1288.3670 1333.1869 1346.6393 1374.2096 1378.6049 1387.8362 1396.1781 1403.3782 1406.8713 1438.6482 1447.1545 1449.4667 1451.3081 1457.9877 1461.3085 1462.3950 1474.1542 1479.5254 1486.3155 1488.3766 1490.5265 1499.5680 1506.5295 1545.9397 1551.5036 1583.6571 1615.4348 1639.9193 1673.7253 2973.5322 2977.3118 2985.6602 2992.4401 3003.9363 3059.4170 3059.8131 3065.8357 3084.1469 3087.2629 3089.2101 3093.6554 3096.1243 3103.0106 3119.0885 3132.2102 3150.8681 3167.2845 3192.1954 3203.9057 3211.5883 3259.3632 3579.7650
redmass: 2.4787 5.3002 5.3568 4.9060 4.2663 3.7850 4.8307 3.3144 2.2304 4.2450 2.6228 4.2402 5.2163 1.7530 4.6001 2.9712 1.1255 6.2336 1.4399 2.0539 2.4670 3.1267 1.5162 3.3757 5.7991 4.8239 2.5130 2.9495 2.8858 3.2392 5.1946 3.3353 2.4571 5.1327 1.6625 5.8203 8.7048 3.2286 5.4130 4.2993 7.5990 4.9259 5.4993 5.6900 8.2767 5.4739 5.8392 1.3430 5.4054 1.4497 6.2298 2.6862 1.0943 5.3199 3.9431 5.0497 3.6057 1.5216 1.3601 5.6674 1.2657 1.6624 1.6955 1.3397 1.2183 1.3534 5.0809 1.3175 3.4644 1.4026 2.4293 1.6121 2.1719 2.1267 1.8297 2.1061 2.1998 1.4736 1.9369 1.7778 1.2139 2.4279 3.2414 2.9454 3.1034 1.1358 2.7309 2.1672 1.8838 2.6155 1.6207 3.1855 1.2042 1.1870 3.1790 1.8113 1.2044 2.8593 2.5697 2.7781 1.2623 1.2234 1.0512 1.0410 1.0581 1.0657 1.0641 1.2353 1.0831 1.6328 1.6809 3.8151 6.8928 7.5108 4.4639 4.4114 3.0604 2.3622 1.0367 1.0361 1.0358 1.0357 1.0579 1.0969 1.1062 1.0972 1.1001 1.1006 1.0985 1.0997 1.0999 1.1021 1.0864 1.0893 1.0947 1.0992 1.0835 1.0928 1.0928 1.1014 1.0765
irintensity: 0.0986 0.0799 0.8711 0.0130 0.8667 1.1539 0.3135 1.7698 1.1404 1.0530 0.1112 0.0478 3.2661 2.7247 3.4054 1.5116 0.1229 2.8025 0.0175 4.2492 1.3198 6.9881 1.8575 1.0859 0.1425 0.0789 1.0596 0.8273 0.9979 1.8107 16.7083 0.6515 23.3497 4.3431 71.8964 1.4492 20.2498 11.1121 0.9835 16.1099 5.6441 0.0321 11.7054 13.2228 7.5193 1.1203 14.5491 68.1217 2.5258 52.4278 0.2207 15.9780 3.7014 17.8481 0.2677 7.3005 8.4279 48.6430 0.0491 9.5524 25.6773 0.0503 0.2655 31.2512 0.9678 10.4368 6.4581 0.0040 49.7129 2.7170 21.0792 34.4928 77.4643 96.6252 3.5306 88.2978 18.0657 4.2184 5.2667 58.8903 9.0210 316.4978 56.5650 26.8888 17.1692 0.1963 378.1013 111.0810 110.3799 1.7127 114.9958 38.9724 14.4355 22.6849 50.0961 51.2402 17.3690 61.7447 137.8256 48.0078 35.5660 41.2915 0.9596 11.1913 3.3451 14.1142 10.8389 25.2141 5.8372 5.3537 148.7042 12.1374 414.0682 51.5309 795.2509 34.4179 398.7885 418.6621 18.9566 48.6623 22.0098 31.6158 23.9207 10.0255 11.1840 96.4837 14.7184 4.1667 35.6422 80.4689 36.2125 49.1206 0.3071 9.2685 28.5306 30.6837 466.6137 10.3066 22.8607 2.9830 91.8934
temp: 298.150 k
press: 1.00000 atm
elementType: 16 8 7 7 7 7 7 6 6 6 6 6 6 6 6 6 6 6 6 6 6 6 6 6 6 6 1 1 1 1 1 1 1 1 1 1 1 1 1 1 1 1 1 1 1 1 1 1 1
symmnumber: 1
zpe: 1026751.3 jmol-1
zpe.correction: 0.391069 hartree
zpe.thermalcorrener: 0.415955 hartree
zpe.thermalcorrenthalpy: 0.416899 hartree
zpe.thermalcorrgfe: 0.335634 hartree
zpe.sumelectzpe: -1482.965251 hartree
zpe.sumelectthermal: -1482.940365 hartree
zpe.sumelectthermalent: -1482.939421 hartree
zpe.sumelectthermalfe: -1483.020686 hartree
dipole: -5.1485 0.6253 0.0152
dipole: 5.1863
quadrupole: -139.9982 -142.6103 -167.8838
quadrupole: 3.6474 0.2461 -0.1404
quadrupole: 10.1659 7.5538 -17.7197 3.6474 0.2461 -0.1404
hfenergy: -1483.3563198 hartree
pointgroup: C01 [X(C19H23N5O1S1)]
dipole: 2.0305384 -0.1718075 -0.104096 debye
polarizability: 363.909827|-19.4067224|375.6027754|-11.3681674|-13.6614909|133.2173396 unknown
InChI: InChI=1S/C19H23N5OS/c1-5-25-16-12-15(13-8-6-7-9-14(13)21-16)22-17(24-19(2,3)4)23-18-20-10-11-26-18/h6-12,22-23H,5H2,1-4H3
charge 0 multiplicity 1
49 atoms
S  5.274015 -1.563542 -0.259741
O  -3.397076 2.179717 -0.006031
N  1.365609 1.904092 -0.200116
N  0.720868 -0.383244 -0.03236
N  3.02625 0.12019 -0.204706
N  -3.557835 -0.169514 0.155176
N  2.699336 -2.26924 -0.047677
C  2.302359 3.05675 -0.350475
C  3.019617 3.028925 -1.733119
C  1.397993 4.316266 -0.296592
C  3.330648 3.155339 0.819251
C  1.666249 0.638761 -0.148372
C  -0.679695 -0.272267 0.028326
C  -1.450306 -1.509697 0.142149
C  -2.891726 -1.390474 0.202115
C  -1.366794 0.945534 -0.016237
C  -0.869421 -2.815506 0.196894
C  -2.79512 0.925908 0.049496
C  -3.686429 -2.573645 0.314107
C  -1.671159 -3.958752 0.306651
C  -3.090764 -3.837684 0.36579
C  3.467381 -1.186619 -0.159484
C  -4.882515 2.209964 0.055987
C  -5.285772 3.679133 -0.037738
C  4.819936 -3.30916 -0.130538
C  3.452301 -3.450064 -0.032247
H  3.604454 3.955978 -1.873802
H  3.712867 2.175126 -1.854153
H  2.269914 2.965229 -2.541198
H  0.873674 4.366636 0.673643
H  0.633228 4.264134 -1.090631
H  1.992558 5.238665 -0.431248
H  4.128457 2.387741 0.790148
H  3.833894 4.138507 0.788735
H  2.809314 3.063359 1.788416
H  1.132997 -1.336504 0.002776
H  -0.823535 1.884787 -0.099491
H  0.217812 -2.946803 0.154129
H  3.737762 0.846479 -0.267809
H  -4.772426 -2.444548 0.356506
H  -1.205795 -4.949768 0.347468
H  -3.712519 -4.735888 0.451473
H  -5.286946 1.605395 -0.776566
H  -5.209486 1.739715 1.001648
H  -6.386752 3.770453 0.005532
H  -4.854273 4.259119 0.796329
H  -4.935719 4.122663 -0.985908
H  5.593996 -4.071902 -0.137752
H  2.932374 -4.404045 0.056045
