program: Gaussian 09
title: 000051145
version: EM64L-G09RevD.01
frameworkgroup: C1[X(C17H36O2)]
method: RPBEPBE
basis: SDD
operation: Freq
keyword: #pfreq=noraman
keyword: PBEPBE/SDD
title: #p freq=noraman PBEPBE/SDD
converged: YES YES NO NO
title: Mulliken charges:
elementType: O O C C C C C C C C C C C C C C C C C H H H H H H H H H H H H H H H H H H H H H H H H H H H H H H H H H H H H
charge: -0.310874 -0.447290 -0.004846 -0.446448 -0.450367 -0.382692 -0.400290 -0.380205 -0.380970 -0.372445 -0.374698 -0.353797 -0.352935 -0.251879 -0.356232 -0.356921 -0.327409 -0.696336 -0.695924 0.191918 0.203209 0.216974 0.229078 0.204259 0.201944 0.218356 0.194840 0.204133 0.187895 0.190460 0.195784 0.194743 0.191927 0.188982 0.189605 0.189855 0.187812 0.187613 0.189033 0.188554 0.195526 0.195051 0.194775 0.194925 0.203385 0.186614 0.198967 0.206451 0.209515 0.215618 0.209731 0.210158 0.209857 0.215359 0.349652
chargesum: 0.00000
title: Mulliken charges with hydrogens summed into heavy atoms:
elementType: O O C C C C C C C C C C C C C C C C C
charge: -0.310874 -0.097639 0.187072 -0.026265 -0.017030 0.037607 -0.001316 -0.001850 0.009556 0.008464 0.004763 0.021628 0.024651 0.138120 0.034346 0.032779 0.078009 -0.061472 -0.060550
polarizability: 2.20550485e+02 -5.36883453e+00 2.03153829e+02 -1.94422540e+00 -7.28309736e-01 1.61120808e+02
1716.lowfreq: -13.8224 -5.0929 -0.0006 0.0004 0.0010 8.2182 13.8261 21.5234 25.0223
frequency: 8.5936 21.1751 24.6984 30.2439 38.5583 47.6182 52.4601 57.3573 72.4737 87.5005 93.1412 104.0683 114.6792 121.4958 126.8269 140.7411 146.5463 169.6905 185.6295 195.9500 209.7128 230.9972 233.6176 239.7114 283.9236 294.8322 302.1865 374.1369 395.7884 408.4754 452.5908 459.8864 494.5609 500.8182 544.9170 612.3919 721.1281 721.3544 728.2084 730.8018 749.6666 763.6837 790.4282 826.7766 830.5706 860.8816 873.7436 887.2320 888.9959 902.7206 916.9595 950.4162 981.3983 992.3261 998.2432 1004.5080 1011.6233 1022.8903 1026.7558 1042.7769 1049.1170 1054.1304 1073.1152 1076.4241 1080.3649 1082.1632 1088.4455 1100.9025 1107.2423 1124.0511 1135.6606 1166.8184 1188.2496 1189.9333 1194.2371 1202.8791 1218.5930 1222.9651 1231.3896 1237.7383 1260.2548 1263.8435 1271.2082 1275.5396 1281.9546 1282.7269 1290.2603 1291.4102 1293.6197 1295.0050 1298.8995 1313.3959 1318.4987 1326.8324 1337.2088 1341.0749 1350.3117 1352.9105 1353.0451 1354.3592 1371.1344 1374.7682 1385.0493 1387.4216 1389.3352 1458.4896 1459.5143 1460.9761 1461.5414 1462.7480 1462.8570 1464.9874 1466.7144 1469.3785 1472.7330 1476.1641 1477.4788 1477.7235 1480.1095 1484.4210 1487.1893 1488.8874 1491.1596 2909.1417 2937.3443 2948.0416 2949.9741 2950.0435 2951.3060 2953.9487 2956.7628 2960.9478 2962.2410 2967.1703 2967.6858 2968.5144 2971.1242 2971.5442 2975.3023 2983.4596 2984.3437 2988.4717 2993.0675 2993.4364 3001.3560 3004.5083 3006.3775 3014.0950 3021.8689 3031.5090 3036.7361 3044.0784 3052.8809 3067.9075 3068.1065 3070.3247 3070.4824 3076.9959 3521.8162
redmass: 3.9766 3.0664 2.2564 3.2885 2.9420 3.7137 2.5550 1.7670 3.5588 2.5161 2.0426 2.0369 2.6018 2.8400 2.3950 1.9449 2.0086 2.9732 2.6860 3.3021 3.4710 1.1264 1.1197 3.0353 2.8524 2.3511 3.1571 2.9553 3.4290 2.9962 2.7433 2.8056 2.0357 1.4341 2.5688 2.6682 1.0632 1.0654 1.1204 1.0955 1.2555 1.1745 1.6699 1.3148 1.4573 2.3199 2.6869 1.8662 1.8876 1.3706 1.3282 2.0281 1.9290 1.5643 2.2944 3.1251 2.3175 2.4412 1.8136 2.9167 3.1440 3.1461 2.4438 2.2586 2.2897 2.1088 1.7718 1.7779 1.8722 2.3617 2.2792 1.9874 1.7073 1.3025 1.4679 1.2710 1.3582 1.3123 1.3788 1.3536 1.2765 1.2784 1.2521 1.2390 1.0546 1.0394 1.1326 1.1391 1.0996 1.0966 1.2257 1.3875 1.2585 1.2225 1.4453 1.4554 1.4976 1.5812 1.6495 1.6945 1.4475 1.5273 1.2667 1.2167 1.2162 1.0775 1.0817 1.0721 1.0720 1.0725 1.0721 1.0890 1.0729 1.0738 1.0764 1.0473 1.0734 1.0428 1.0784 1.0851 1.0837 1.0915 1.0959 1.0826 1.0547 1.0589 1.0588 1.0589 1.0588 1.0593 1.0591 1.0592 1.0709 1.0595 1.0587 1.0602 1.0368 1.0365 1.0603 1.0966 1.0960 1.0639 1.0971 1.0980 1.1032 1.1013 1.0994 1.1031 1.1038 1.1044 1.1043 1.1039 1.1027 1.1007 1.1007 1.0993 1.0993 1.0961 1.0648
irintensity: 0.0443 0.3377 0.8870 1.0851 0.8920 0.2252 0.2726 0.0614 0.1222 0.3159 0.1777 0.8502 0.1358 1.3727 0.0776 0.0187 0.5511 2.8975 3.3634 7.6892 1.7114 0.0045 0.0033 0.3569 0.5962 1.4187 2.3756 1.4570 1.3914 3.2680 2.3865 3.7217 55.7803 106.3681 12.1411 0.9422 14.1471 12.6445 1.0786 0.1542 3.5827 4.2785 4.0432 0.0674 3.2770 4.5800 20.7098 3.8805 4.2252 0.9967 4.5211 33.3306 0.9825 25.0354 8.6005 14.3093 93.1973 1.8493 1.0349 2.1148 39.7828 27.0418 0.2650 0.6091 4.5254 0.3698 12.0075 2.1872 2.3033 27.5782 8.5503 5.7784 0.3485 9.4233 2.6097 27.8469 7.4438 11.7857 1.4562 0.9369 0.7429 0.7932 0.6146 4.0412 0.9234 0.3857 0.8461 0.0294 0.0823 0.9093 6.3402 5.6403 20.9437 11.4292 8.9236 6.4488 0.5169 1.1371 0.6710 0.1876 3.3147 8.4352 34.5278 11.3483 11.5130 11.2140 4.7644 0.4265 0.0146 2.1531 4.1214 2.8813 0.0122 1.4001 2.3976 10.6919 3.9320 11.6959 0.3171 6.4209 5.2123 49.3163 1.8168 52.0239 43.7402 2.7150 0.0280 0.0166 2.0370 0.2152 24.9982 24.1051 30.9881 30.0114 172.5962 7.8306 37.2200 36.4499 134.8451 1.2662 0.2642 38.0770 4.7300 3.6168 70.4960 13.5551 11.4164 4.8253 0.4492 12.6957 70.6430 161.6474 120.1338 97.7569 94.9261 54.5273 55.4692 41.3932 10.7509
temp: 298.150 k
press: 1.00000 atm
elementType: 8 8 6 6 6 6 6 6 6 6 6 6 6 6 6 6 6 6 6 1 1 1 1 1 1 1 1 1 1 1 1 1 1 1 1 1 1 1 1 1 1 1 1 1 1 1 1 1 1 1 1 1 1 1 1
symmnumber: 1
zpe: 1314830.9 jmol-1
zpe.correction: 0.500793 hartree
zpe.thermalcorrener: 0.526639 hartree
zpe.thermalcorrenthalpy: 0.527583 hartree
zpe.thermalcorrgfe: 0.439008 hartree
zpe.sumelectzpe: -818.221680 hartree
zpe.sumelectthermal: -818.195834 hartree
zpe.sumelectthermalent: -818.194890 hartree
zpe.sumelectthermalfe: -818.283464 hartree
dipole: -0.2802 -2.7374 1.6750
dipole: 3.2214
quadrupole: -118.1046 -146.6573 -123.5127
quadrupole: -2.0968 -0.9613 7.7742
quadrupole: 11.3203 -17.2324 5.9122 -2.0968 -0.9613 7.7742
hfenergy: -818.7224725 hartree
pointgroup: C01 [X(C17H36O2)]
dipole: -0.0525858 1.0733553 -0.6719257 debye
polarizability: 220.9390396|4.6005418|202.6814319|2.6547848|-1.2231104|161.2046511 unknown
InChI: InChI=1S/C17H36O2/c1-3-5-7-9-11-13-17(19-16-15-18)14-12-10-8-6-4-2/h17-18H,3-16H2,1-2H3
charge 0 multiplicity 1
55 atoms
O  -0.876264 -2.829574 0.253515
O  -1.019593 -5.539784 0.941745
C  -0.10685 -1.911883 -0.624921
C  -1.01537 -0.808075 -1.217887
C  1.053035 -1.402033 0.249946
C  -1.680746 0.109972 -0.169403
C  2.043217 -0.479773 -0.49755
C  -2.753016 1.041788 -0.778518
C  3.286853 -0.132566 0.351293
C  -3.374187 2.004868 0.258094
C  4.267075 0.824829 -0.36361
C  -4.46999 2.922092 -0.33096
C  5.519706 1.156327 0.478036
C  -1.857843 -3.678233 -0.440771
C  -5.068839 3.89962 0.70611
C  6.494043 2.126275 -0.229259
C  -2.212944 -4.78346 0.557709
C  -6.172099 4.804499 0.115743
C  7.747055 2.443939 0.614987
H  0.310467 -2.513516 -1.467211
H  -1.802157 -1.288785 -1.83492
H  -0.411673 -0.201284 -1.92263
H  0.638365 -0.878896 1.132566
H  1.59617 -2.287109 0.636094
H  -0.909171 0.730584 0.329784
H  -2.13678 -0.516704 0.622636
H  2.370552 -0.96895 -1.439336
H  1.535625 0.460594 -0.793935
H  -3.556982 0.427455 -1.236288
H  -2.30614 1.632812 -1.605717
H  2.960701 0.324785 1.308865
H  3.818562 -1.06888 0.620699
H  -3.801575 1.414624 1.095512
H  -2.570917 2.631405 0.699769
H  3.738087 1.76675 -0.620191
H  4.582821 0.374037 -1.328034
H  -5.28376 2.297705 -0.756059
H  -4.048736 3.502087 -1.178814
H  6.055868 0.216093 0.725273
H  5.205311 1.597548 1.447259
H  -5.48017 3.319229 1.557211
H  -4.256246 4.528754 1.123728
H  5.959254 3.068011 -0.469552
H  6.802231 1.688202 -1.200772
H  -1.397529 -4.113351 -1.354232
H  -2.761948 -3.100534 -0.727984
H  -2.698492 -4.331019 1.448382
H  -2.905782 -5.510537 0.101207
H  -5.77942 5.413561 -0.720466
H  -6.580029 5.496524 0.875454
H  -7.012033 4.20032 -0.276492
H  8.316418 1.522466 0.840743
H  7.467379 2.908703 1.579462
H  8.425754 3.140137 0.088602
H  -0.329666 -4.859946 1.164287
