program: Orca
programVersion: 5.0.3
elementType: C H C H C C C H H C H H C C H H H H H H H
charge: 1
multiplicity: 1
keywords: DSD-PBEP86 cc-pVTZ EnGrad D3BJ RIJCOSX verytightscf cc-pVTZ/C def2/J soscf
formula: C8H13
InChI: InChI=1/C8H13/c1-2-4-6-8-7-5-3-1/h1-2,7H,3-6,8H2
21 atoms
C  -2.00118 0.75511 0.069179
H  -2.163172 0.81911 1.147818
C  -1.730073 -0.973257 -0.162881
H  -2.618976 -1.328141 0.36287
C  -0.412901 -1.387169 0.389835
C  0.683431 -1.272793 -0.38345
C  1.998516 -0.696317 0.062614
H  2.203862 -0.900836 1.118857
H  2.854354 -1.036047 -0.527094
C  1.787734 0.846095 -0.13587
H  1.823372 1.10961 -1.198734
H  2.591938 1.396736 0.359276
C  0.423757 1.27787 0.494742
C  -0.766865 1.294418 -0.364447
H  0.518349 -1.193878 -1.462709
H  -1.830568 -1.132495 -1.237054
H  0.208968 0.687276 1.389177
H  -0.659236 1.623987 -1.401574
H  -2.882936 0.997013 -0.522556
H  0.495739 2.323581 0.866332
H  -0.328891 -1.478056 1.472022
totalener: -311.10472848 hartree
nucrepener: 379.26048563 hartree
electener: -690.36521411 hartree
oneelecener: -1158.93538399 hartree
twoeener: 468.57016988 hartree
kineticenergy: 309.73211250 hartree
exchangeener: -13.662043308920 hartree
correlationener: -0.921075180444 hartree
xcener: -14.583118489364 hartree
chargesum: 1.0000000
charge: -0.266754 0.201107 -0.237023 0.200010 -0.156266 -0.125162 -0.235989 0.157191 0.174238 -0.255722 0.158308 0.177129 -0.244055 0.097947 0.163719 0.190925 0.159693 0.236715 0.202652 0.214709 0.186626
charge: 0.133427 0.013965 0.178586 0.006236 0.021399 0.064792 0.073144 -0.004340 -0.002655 0.104943 -0.011716 -0.001400 0.077503 0.309502 -0.017157 -0.001235 0.006273 0.019395 0.005690 0.045690 -0.022042
qa: -0.2668 0.2011 -0.2370 0.2000 -0.1563 -0.1252 -0.2360 0.1572 0.1742 -0.2557 0.1583 0.1771 -0.2441 0.0979 0.1637 0.1909 0.1597 0.2367 0.2027 0.2147 0.1866
va: 3.8851 0.9708 3.9039 0.9653 3.8183 3.8466 3.9046 0.9869 0.9775 3.8876 0.9841 0.9746 3.9070 3.5549 0.9837 0.9720 0.9981 0.9555 0.9731 0.9630 0.9805
dispcorr: -0.011871829 hartree
energy: -311.809198830508
dipole: 0.19927 -1.10782 -0.90855 1.76794 -0.61125 1.15669 0.34331 -0.47892 -0.13561
magnitude: 1.47709 au
magnitude: 3.75446 debye
