program: Gaussian 09
title: 000051126
version: EM64L-G09RevD.01
frameworkgroup: C1[X(C12H3Cl5O)]
method: RPBEPBE
basis: SDD
operation: Freq
keyword: #p
keyword: freq=noraman
keyword: PBEPBE/SDD
title: #p freq=noraman PBEPBE/SDD
converged: NO NO NO NO
title: Mulliken charges:
elementType: Cl Cl Cl Cl Cl O C C C C C C C C C C C C H H H
charge: -0.016863 0.049326 0.005615 0.053975 -0.022837 -0.234141 0.291605 0.369840 0.311958 0.216799 -0.410013 -0.303599 -0.270100 -0.351111 -0.115856 -0.102730 -0.252987 -0.089005 0.295021 0.292277 0.282827
chargesum: 0.00000
title: Mulliken charges with hydrogens summed into heavy atoms:
elementType: Cl Cl Cl Cl Cl O C C C C C C C C C C C C
charge: -0.016863 0.049326 0.005615 0.053975 -0.022837 -0.234141 0.291605 0.369840 0.311958 0.216799 -0.114993 -0.303599 -0.270100 -0.058834 -0.115856 -0.102730 0.029840 -0.089005
polarizability: 3.21949585e+02 1.10252106e+01 2.04008772e+02 8.40370744e-04 -1.45927225e-03 6.26327477e+01
1716.lowfreq: -0.0018 -0.0009 0.0010 2.1196 2.9269 6.5386 40.0002 55.9313 82.5466
frequency: 39.9993 55.9259 82.5464 92.3890 138.4930 151.0253 158.9305 186.4362 196.0687 215.2086 236.2001 260.3537 261.8526 330.7968 343.4822 375.8717 379.3594 381.8211 434.0039 482.0497 521.5122 532.5857 562.1904 575.7605 617.3790 626.4366 681.1732 719.4097 721.1804 757.3358 762.6505 841.7633 855.0329 863.1825 872.7506 885.2845 912.2382 1022.1397 1073.7882 1135.5406 1148.5894 1183.5030 1201.6693 1267.1666 1341.3766 1357.3699 1381.7000 1407.7523 1412.9228 1453.7202 1555.2891 1584.9025 1596.2411 1631.9116 3185.5275 3192.0912 3195.8440
redmass: 28.6131 17.6300 24.0163 21.6404 9.5677 32.4310 7.9611 24.4963 31.3609 20.9524 5.4868 8.2229 19.5147 28.1271 7.2287 10.5546 16.8544 11.1187 10.5118 8.9180 5.1930 5.3905 8.6246 4.6427 5.8467 8.5135 12.2500 9.8725 6.9849 5.9167 11.4624 8.4046 1.4201 1.3883 9.4875 1.4785 11.1373 7.6499 1.7627 5.0545 2.0065 5.4421 1.8187 4.0889 3.6202 4.5724 8.8641 5.3591 6.3607 4.8559 10.3516 10.0009 9.5330 10.1287 1.0931 1.0936 1.0944
irintensity: 0.0001 0.0227 0.0006 0.1315 0.0112 0.1382 0.3143 0.1824 0.0297 0.0430 1.0072 0.0536 0.2836 0.0058 0.8621 5.2713 3.2849 1.1398 24.0047 6.7459 3.3779 0.0500 2.1081 9.3440 0.4672 1.2120 10.3510 0.1458 0.3143 8.2165 122.2868 21.7389 48.5272 7.2996 2.7385 19.4169 174.3928 24.6144 7.9889 23.1629 60.6005 19.2180 1.7948 22.6177 32.8242 132.0218 12.2055 63.7755 74.5970 30.3174 94.7931 4.6814 69.6457 53.1248 1.7899 1.9910 2.5484
temp: 298.150 k
press: 1.00000 atm
elementType: 17 17 17 17 17 8 6 6 6 6 6 6 6 6 6 6 6 6 1 1 1
symmnumber: 1
zpe: 295715.2 jmol-1
zpe.correction: 0.112632 hartree
zpe.thermalcorrener: 0.128133 hartree
zpe.thermalcorrenthalpy: 0.129077 hartree
zpe.thermalcorrgfe: 0.068082 hartree
zpe.sumelectzpe: -2833.363284 hartree
zpe.sumelectthermal: -2833.347782 hartree
zpe.sumelectthermalent: -2833.346838 hartree
zpe.sumelectthermalfe: -2833.407834 hartree
dipole: -1.8322 0.4534 -0.0002
dipole: 1.8875
quadrupole: -142.2242 -135.7251 -138.1341
quadrupole: -0.6863 0.0003 -0.0004
quadrupole: -3.5297 2.9694 0.5604 -0.6863 0.0003 -0.0004
hfenergy: -2833.4759157 hartree
pointgroup: C01 [X(C12H3Cl5O1)]
dipole: 0.7177729 0.190354 0.0000602 debye
dipolederiv: -0.1373145 0.1207345 -0.0000064 -0.0240688 -0.6913886 0.0000103 -0.0000119 -0.0000236 -0.0361761 -0.0757389 -0.1245384 -0.0000054 -0.2147932 -0.6053885 -0.0000166 -0.0000032 0.0000066 0.0154427 -0.4203758 0.3005833 0.00002 0.4180079 -0.4065207 -0.0000273 0.000056 -0.0000444 -0.0230032 -0.7780853 -0.1421406 0.0000385 -0.2030364 -0.0308046 0.0000096 0.0000943 0.0000159 0.0127459 -0.9318719 0.1945707 -0.0000231 0.2465543 -0.1723438 0.0000038 -0.000038 0.0000062 -0.0444351 -1.3338204 -0.0197036 -0.0000122 0.0391613 -0.4280306 0.0000034 -0.0000388 0.0000277 -0.1371737 0.23359 -0.1309326 0.0000013 0.2033343 0.0311575 0.0000143 -0.0000193 0.0000047 0.0123525 0.0123774 0.1795841 -0.0000092 -0.2669552 -0.4631063 -0.000001 0.0000008 0.0000086 0.0228554 0.5426004 -0.2506471 0.0000273 -0.7511471 -0.0453316 -0.000031 0.0000701 -0.0000218 0.1120289 0.8048273 0.1296763 -0.0000087 0.5310589 0.3680738 -0.0000087 -0.0000237 -0.0000158 0.0939525 -0.0844668 0.195963 0.0000154 0.0113852 -0.1413273 0.0000028 0.0000168 -0.0000049 -0.0984733 0.4570961 -0.2519893 0.0000275 0.1857406 1.1157062 -0.0000093 0.0000462 0.0000199 -0.052298 -0.0278741 0.2787848 0.0000197 0.3471563 0.9535303 0.0000298 0.0000501 0.000007 -0.0588454 -0.508186 -0.0443679 -0.0000016 -0.0406409 -0.1025928 -0.0000032 -0.0000108 -0.0000315 -0.1268184 0.3194881 -0.6227726 -0.0000303 -0.7804828 0.5681201 0.0000529 -0.0000524 0.0000776 -0.0400019 0.8799103 0.2575249 -0.0000753 0.4503542 -0.1629288 -0.0000304 -0.0001489 -0.0000437 -0.0471191 -0.525802 0.2326555 -0.0000058 0.2836738 -0.3846829 0.0000142 -0.0000114 0.0000096 -0.0757583 1.2996097 -0.2359505 0.000042 -0.416214 0.4368918 -0.000008 0.0000381 0.0000055 -0.0695819 0.1133026 -0.0346123 -0.0000002 -0.0042909 0.0440372 -0.0000079 -0.0000024 -0.0000126 0.1716649 0.1034157 0.0050351 -0.0000036 0.0178147 0.0485328 0.0000063 -0.0000033 0.0000139 0.1934323 0.0573181 -0.0374573 -0.0000099 -0.0326122 0.0683967 -0.0000041 -0.0000083 -0.000005 0.1752093 unknown
polarizability: 322.2839663|-9.0557305|203.6743904|0.000816|0.0014731|62.6327477 unknown
InChI: InChI=1S/C12H3Cl5O/c13-4-1-6(14)9-5-3-7(15)10(16)11(17)12(5)18-8(9)2-4/h1-3H
charge 0 multiplicity 1
21 atoms
Cl 1.735539 3.162135 -0.000045
Cl -2.59854 -3.010946 -0.000113
Cl -3.978717 2.437725 0.000096
Cl -4.886644 -0.676093 0.000097
Cl 5.479734 -0.924357 0.000112
O  0.279593 -1.768312 0.00001
C  -0.401968 0.482153 -0.000069
C  1.057571 0.443488 -0.000056
C  -0.819593 -0.881405 -0.000086
C  1.425571 -0.937258 -0.000029
C  -1.377491 1.502174 -0.000062
C  2.105682 1.387164 -0.000049
C  -2.16508 -1.267702 -0.000111
C  2.741718 -1.410852 -0.000015
C  -2.732869 1.12463 -0.000053
C  -3.140515 -0.240307 -0.000077
C  3.450515 0.973083 0.000076
C  3.738738 -0.414622 0.000048
H  -1.101889 2.55826 0.000014
H  2.976375 -2.476766 0.000035
H  4.26017 1.706608 0.000176
