program: Orca
programVersion: 5.0.3
elementType: C H C H C C C H H C H H C C H H H H H H H
charge: 1
multiplicity: 1
keywords: DSD-PBEP86/2013 def2-TZVP RIJCOSX verytightscf def2-TZVP/C def2/J soscf noTRAH
formula: C8H13
InChI: InChI=1/C8H13/c1-3-7-5-2-6-8(4-1)9-7/h3,6-8H,1-2,4-5H2
21 atoms
C  -1.999279 0.675532 0.100031
H  -2.199406 0.866803 1.158688
C  -1.819036 -0.928062 -0.133023
H  -2.639031 -1.431547 0.382011
C  -0.450508 -1.334674 0.399218
C  0.691425 -1.27334 -0.365137
C  2.002704 -0.673577 0.089319
H  2.206967 -0.875261 1.145278
H  2.851673 -1.011779 -0.507492
C  1.823125 0.926678 -0.132232
H  1.901957 1.148288 -1.201335
H  2.63864 1.433499 0.386794
C  0.449172 1.317821 0.404455
C  -0.697092 1.288716 -0.356591
H  0.538809 -1.233274 -1.44767
H  -1.899981 -1.139754 -1.203899
H  0.003682 0.000242 0.165283
H  -0.554727 1.281738 -1.440983
H  -2.854631 1.009944 -0.489672
H  0.34444 1.351536 1.491888
H  -0.344879 -1.394928 1.485326
totalener: -311.10380187 hartree
nucrepener: 382.82490050 hartree
electener: -693.92870237 hartree
oneelecener: -1165.55562313 hartree
twoeener: 471.62692076 hartree
kineticenergy: 309.93545664 hartree
exchangeener: -12.752159334954 hartree
correlationener: -0.949702671031 hartree
xcener: -13.701862005985 hartree
chargesum: 1.0000000
charge: -0.222726 0.166747 -0.249367 0.183304 -0.122656 -0.051800 -0.225081 0.166248 0.180897 -0.252136 0.168640 0.182915 -0.116157 -0.058702 0.165261 0.168999 0.204645 0.166588 0.181059 0.181899 0.181425
charge: -0.194061 0.151167 -0.192434 0.153848 -0.132563 -0.077413 -0.194535 0.150931 0.154168 -0.192805 0.150284 0.153575 -0.136229 -0.073094 0.163985 0.150486 0.320152 0.163704 0.154293 0.163566 0.162975
qa: -0.2227 0.1667 -0.2494 0.1833 -0.1227 -0.0518 -0.2251 0.1662 0.1809 -0.2521 0.1686 0.1829 -0.1162 -0.0587 0.1653 0.1690 0.2046 0.1666 0.1811 0.1819 0.1814
va: 3.8771 0.9707 3.9164 0.9672 3.8132 3.8620 3.8814 0.9706 0.9674 3.9206 0.9685 0.9676 3.7964 3.8778 0.9651 0.9687 0.9988 0.9641 0.9672 0.9630 0.9629
total: -311.800153600 hartree
energy: -311.800153600403
dipole: -0.00604 -0.00584 -0.01188 0.00576 -0.00166 0.00410 -0.07067 0.03646 -0.03421
magnitude: 0.03644 au
magnitude: 0.09263 debye
