program: Orca
programVersion: 5.0.3
elementType: C H C H C C C H H C H H C C H H H H H H H
charge: 1
multiplicity: 1
keywords: b3lyp def2-TZVP EnGrad RIJCOSX verytightscf def2/J soscf
formula: C8H13
InChI: InChI=1/C8H13/c1-2-4-6-8-7-5-3-1/h1-2,7H,3-6,8H2
21 atoms
C  -2.003064 0.717775 0.071387
H  -2.174614 0.798199 1.148344
C  -1.743427 -0.971979 -0.170372
H  -2.624668 -1.367708 0.340762
C  -0.410137 -1.376437 0.381533
C  0.675976 -1.268087 -0.397405
C  1.988141 -0.706012 0.065088
H  2.185888 -0.925854 1.119527
H  2.848397 -1.038551 -0.523524
C  1.792952 0.831873 -0.126103
H  1.826058 1.0947 -1.189341
H  2.60088 1.380063 0.365849
C  0.434015 1.324341 0.49863
C  -0.758601 1.278003 -0.344061
H  0.514959 -1.189285 -1.477139
H  -1.829795 -1.140026 -1.245472
H  0.246864 0.863485 1.470931
H  -0.657289 1.634263 -1.373632
H  -2.873189 0.99377 -0.524668
H  0.547411 2.41691 0.682215
H  -0.318684 -1.453475 1.464354
totalener: -312.21836489 hartree
nucrepener: 379.04844163 hartree
electener: -691.26680652 hartree
oneelecener: -1159.19446224 hartree
twoeener: 467.92765572 hartree
kineticenergy: 310.52820127 hartree
exchangeener: -36.318693989708 hartree
correlationener: -2.303032414879 hartree
xcener: -38.621726404587 hartree
chargesum: 1.0000000
charge: -0.223735 0.183712 -0.203109 0.179839 -0.167155 -0.074079 -0.202016 0.143834 0.154317 -0.248977 0.147426 0.160807 -0.123257 0.088557 0.124005 0.175280 0.149450 0.204904 0.181124 0.195998 0.153075
charge: -0.163449 0.171796 -0.127796 0.159309 -0.171365 -0.130973 -0.219838 0.151216 0.152984 -0.197566 0.146667 0.154059 -0.199416 0.111539 0.152079 0.154286 0.164008 0.173753 0.161327 0.208117 0.149264
qa: -0.2237 0.1837 -0.2031 0.1798 -0.1672 -0.0741 -0.2020 0.1438 0.1543 -0.2490 0.1474 0.1608 -0.1233 0.0886 0.1240 0.1753 0.1495 0.2049 0.1811 0.1960 0.1531
va: 3.8576 0.9604 3.8151 0.9594 3.8296 3.7975 3.8653 0.9712 0.9716 3.8930 0.9663 0.9644 3.7916 3.5703 0.9698 0.9615 0.9873 0.9460 0.9668 0.9527 0.9689
energy: -312.218364886904
dipole: 0.27364 -1.06526 -0.79161 1.93484 -0.66202 1.27282 0.24175 -0.37393 -0.13218
magnitude: 1.50472 au
magnitude: 3.82470 debye
