program: Orca
programVersion: 5.0.3
elementType: C H C H C C C H H C H H C C H H H H H H H
charge: 1
multiplicity: 1
keywords: b3lyp cc-pVTZ EnGrad D3BJ RIJCOSX verytightscf cc-pVTZ/C def2/J soscf
formula: C8H13
InChI: InChI=1/C8H13/c1-2-4-6-8-7-5-3-1/h1-2,7H,3-6,8H2
21 atoms
C  -1.997427 0.530175 0.119988
H  -2.175172 0.722971 1.181514
C  -1.954241 -0.996803 -0.170454
H  -2.675724 -1.589381 0.394366
C  -0.517017 -1.142136 0.282753
C  0.610695 -1.125062 -0.503295
C  1.907451 -0.652386 0.065141
H  2.008244 -0.952295 1.113617
H  2.762947 -1.044646 -0.491417
C  1.893823 0.912461 -0.036545
H  2.018285 1.204706 -1.085886
H  2.74157 1.327974 0.514583
C  0.556779 1.481499 0.490676
C  -0.549944 0.829118 -0.264756
H  0.530958 -1.30084 -1.575655
H  -2.068496 -1.205737 -1.238231
H  0.439955 1.357449 1.572137
H  -0.423218 0.892045 -1.348485
H  -2.71797 1.097253 -0.478061
H  0.525787 2.562603 0.278786
H  -0.367182 -1.091157 1.362491
totalener: -312.24985735 hartree
nucrepener: 385.39946110 hartree
electener: -697.64931845 hartree
oneelecener: -1171.66434732 hartree
twoeener: 474.01502887 hartree
kineticenergy: 310.00338362 hartree
exchangeener: -36.322166205050 hartree
correlationener: -2.308669802213 hartree
xcener: -38.630836007263 hartree
chargesum: 1.0000000
charge: -0.161525 0.140624 -0.172861 0.153797 -0.038483 -0.039775 -0.186601 0.135313 0.154502 -0.189766 0.132249 0.152330 -0.167776 -0.033090 0.186815 0.138087 0.134984 0.174674 0.153686 0.167968 0.164848
charge: 0.099615 -0.001291 0.103764 -0.002256 0.125221 0.159291 0.085557 0.000187 0.005688 0.102066 -0.007181 -0.001202 0.069862 0.234573 -0.001527 -0.001583 -0.002139 0.001507 0.000167 0.023861 0.005821
qa: -0.1615 0.1406 -0.1729 0.1538 -0.0385 -0.0398 -0.1866 0.1353 0.1545 -0.1898 0.1322 0.1523 -0.1678 -0.0331 0.1868 0.1381 0.1350 0.1747 0.1537 0.1680 0.1648
va: 3.8244 0.9918 3.8410 0.9833 3.7654 3.7562 3.8739 0.9907 0.9831 3.8406 0.9878 0.9806 3.8489 3.6740 0.9774 0.9930 0.9915 0.9904 0.9814 0.9756 0.9930
dispcorr: -0.035497070 hartree
energy: -312.285354420924
dipole: 0.56226 -0.72192 -0.15967 1.85430 -1.71844 0.13586 0.18704 -0.33503 -0.14799
magnitude: 0.25662 au
magnitude: 0.65227 debye
