program: Orca
programVersion: 5.0.3
elementType: C H C H C C C H H C H H C C H H H H H H H
charge: 1
multiplicity: 1
keywords: DSD-PBEP86 def2-TZVP D3BJ RIJCOSX verytightscf def2-TZVP/C def2/J soscf noTRAH
formula: C8H13
InChI: InChI=1/C8H13/c1-2-4-6-8-7-5-3-1/h1-2,7H,3-6,8H2
21 atoms
C  -1.99905 0.524404 0.11765
H  -2.179525 0.723718 1.177389
C  -1.97311 -1.003435 -0.166139
H  -2.677779 -1.599465 0.415269
C  -0.528671 -1.112214 0.276295
C  0.603963 -1.10385 -0.510263
C  1.905228 -0.644172 0.060274
H  2.000352 -0.953894 1.106418
H  2.753915 -1.045846 -0.499647
C  1.908607 0.92219 -0.026133
H  2.053154 1.224203 -1.069916
H  2.750778 1.321941 0.544709
C  0.564111 1.479438 0.485207
C  -0.530606 0.774824 -0.254306
H  0.525425 -1.291415 -1.580627
H  -2.097607 -1.222024 -1.230591
H  0.451481 1.375213 1.56945
H  -0.413472 0.844971 -1.338871
H  -2.69688 1.109604 -0.488592
H  0.501929 2.552933 0.250323
H  -0.375982 -1.062804 1.35544
totalener: -311.15635924 hartree
nucrepener: 386.37718399 hartree
electener: -697.53354324 hartree
oneelecener: -1172.99641852 hartree
twoeener: 475.46287528 hartree
kineticenergy: 310.03832773 hartree
exchangeener: -13.676934620105 hartree
correlationener: -0.927425787141 hartree
xcener: -14.604360407247 hartree
chargesum: 1.0000000
charge: -0.196630 0.163115 -0.195623 0.177744 -0.074641 -0.047379 -0.222734 0.158770 0.177099 -0.236425 0.151900 0.172781 -0.207417 -0.041680 0.205846 0.158642 0.148622 0.176253 0.174126 0.178071 0.179560
charge: -0.187451 0.152546 -0.182037 0.149240 -0.061689 -0.006280 -0.202927 0.155096 0.157302 -0.206306 0.146213 0.150551 -0.223248 0.024135 0.166239 0.151774 0.150723 0.171922 0.149781 0.170962 0.173455
qa: -0.1966 0.1631 -0.1956 0.1777 -0.0746 -0.0474 -0.2227 0.1588 0.1771 -0.2364 0.1519 0.1728 -0.2074 -0.0417 0.2058 0.1586 0.1486 0.1763 0.1741 0.1781 0.1796
va: 3.8702 0.9744 3.8736 0.9723 3.8494 3.7886 3.9051 0.9682 0.9681 3.8767 0.9715 0.9676 3.9212 3.7325 0.9449 0.9741 0.9731 0.9590 0.9711 0.9665 0.9603
total: -311.830699840 hartree
dispcorr: -0.011502042 hartree
energy: -311.842201881807
dipole: 0.55832 -0.71177 -0.15344 1.85073 -1.84710 0.00362 0.19736 -0.39045 -0.19309
magnitude: 0.24666 au
magnitude: 0.62696 debye
