program: Orca
programVersion: 5.0.3
elementType: C H C H C C C H H C H H C C H H H H H H H
charge: 1
multiplicity: 1
keywords: m062x def2-TZVP EnGrad RIJCOSX verytightscf def2/J soscf
formula: C8H13
InChI: InChI=1/C8H13/c1-2-4-6-8-7-5-3-1/h1-2,7H,3-6,8H2
21 atoms
C  -2.000738 0.730318 0.078921
H  -2.199462 0.869744 1.145226
C  -1.75565 -0.933399 -0.145394
H  -2.618636 -1.353864 0.375991
C  -0.428354 -1.361938 0.406821
C  0.696382 -1.284647 -0.365152
C  2.008077 -0.687227 0.069193
H  2.221267 -0.878634 1.126457
H  2.859091 -1.023406 -0.527376
C  1.800251 0.894048 -0.144611
H  1.858702 1.132068 -1.211881
H  2.613203 1.424268 0.355752
C  0.423937 1.265748 0.444152
C  -0.748253 1.319449 -0.373556
H  0.530491 -1.21103 -1.444513
H  -1.848183 -1.125879 -1.216163
H  0.091483 0.238387 0.833051
H  -0.613855 1.369678 -1.458239
H  -2.870311 0.989498 -0.525767
H  0.375466 1.775262 1.416772
H  -0.347237 -1.517468 1.484676
totalener: -312.24271494 hartree
nucrepener: 381.04862763 hartree
electener: -693.29134257 hartree
oneelecener: -1162.71000350 hartree
twoeener: 469.41866093 hartree
kineticenergy: 310.35450793 hartree
xcener: -23.092535092414 hartree
chargesum: 1.0000000
charge: -0.314669 0.220957 -0.337974 0.213965 -0.140146 -0.115790 -0.312171 0.201993 0.197910 -0.360956 0.207662 0.200492 -0.165499 0.046729 0.179643 0.217977 0.146069 0.217315 0.213985 0.258964 0.223545
charge: -0.183130 0.165060 -0.164049 0.164940 -0.199592 -0.098205 -0.217204 0.155288 0.154879 -0.205491 0.151547 0.157284 -0.212687 0.066389 0.158743 0.157299 0.259522 0.172199 0.164111 0.192351 0.160746
qa: -0.3147 0.2210 -0.3380 0.2140 -0.1401 -0.1158 -0.3122 0.2020 0.1979 -0.3610 0.2077 0.2005 -0.1655 0.0467 0.1796 0.2180 0.1461 0.2173 0.2140 0.2590 0.2235
va: 3.7222 0.9433 3.7802 0.9506 3.5153 3.7445 3.7177 0.9491 0.9599 3.7785 0.9446 0.9605 3.5281 3.5748 0.9524 0.9412 1.0056 0.9400 0.9546 0.9331 0.9404
energy: -312.242714937477
dipole: 0.04878 -0.61738 -0.56860 0.64586 0.07858 0.72444 0.33199 -0.37531 -0.04332
magnitude: 0.92196 au
magnitude: 2.34343 debye
