program: Orca
programVersion: 5.0.3
elementType: C H C H C C C H H C H H C C H H H H H H H
charge: 1
multiplicity: 1
keywords: PBE0 def2-TZVP EnGrad RIJCOSX verytightscf def2/J soscf
formula: C8H13
InChI: InChI=1/C8H13/c1-2-4-6-8-7-5-3-1/h1-2,7H,3-6,8H2
21 atoms
C  -1.992649 0.547129 0.114293
H  -2.168165 0.733518 1.177851
C  -1.905371 -0.982192 -0.174544
H  -2.669675 -1.555368 0.355098
C  -0.487066 -1.216335 0.307058
C  0.624869 -1.174847 -0.482459
C  1.91625 -0.670971 0.070846
H  2.038667 -0.949695 1.122861
H  2.782061 -1.040381 -0.486759
C  1.861597 0.888062 -0.061556
H  1.944877 1.163549 -1.119729
H  2.71303 1.341615 0.453373
C  0.533711 1.473352 0.504251
C  -0.600501 0.970957 -0.292273
H  0.53319 -1.308516 -1.560328
H  -1.994523 -1.180327 -1.247301
H  0.404001 1.283295 1.573845
H  -0.466092 1.07022 -1.372934
H  -2.763579 1.056273 -0.475271
H  0.582202 2.569036 0.365136
H  -0.344612 -1.181897 1.388821
totalener: -312.07405208 hartree
nucrepener: 383.00407830 hartree
electener: -695.07813039 hartree
oneelecener: -1166.97705657 hartree
twoeener: 471.89892618 hartree
kineticenergy: 310.16286348 hartree
exchangeener: -34.178659361724 hartree
correlationener: -1.968551431086 hartree
xcener: -36.147210792810 hartree
chargesum: 1.0000000
charge: -0.194660 0.165353 -0.203528 0.176250 -0.086924 -0.091699 -0.221422 0.160551 0.174617 -0.245349 0.157805 0.176645 -0.169463 -0.035777 0.181929 0.162229 0.156975 0.193909 0.178736 0.195784 0.168039
charge: -0.207716 0.160535 -0.201740 0.155586 -0.066712 -0.079744 -0.219913 0.159041 0.163798 -0.210418 0.153293 0.157168 -0.228742 0.083842 0.164360 0.158588 0.160391 0.173707 0.163251 0.193905 0.167520
qa: -0.1947 0.1654 -0.2035 0.1763 -0.0869 -0.0917 -0.2214 0.1606 0.1746 -0.2453 0.1578 0.1766 -0.1695 -0.0358 0.1819 0.1622 0.1570 0.1939 0.1787 0.1958 0.1680
va: 3.9129 0.9725 3.9022 0.9701 3.9283 3.9119 3.9536 0.9690 0.9690 3.9403 0.9692 0.9630 3.9450 3.8123 0.9572 0.9738 0.9730 0.9483 0.9686 0.9599 0.9630
energy: -312.074052084851
dipole: 0.55419 -0.81385 -0.25966 1.87342 -1.39137 0.48205 0.16350 -0.29210 -0.12861
magnitude: 0.56244 au
magnitude: 1.42960 debye
