program: Orca
programVersion: 5.0.3
elementType: C H C H C C C H H C H H C C H H H H H H H
charge: 1
multiplicity: 1
keywords: DSD-PBEP86/2013 cc-pVTZ EnGrad RIJCOSX verytightscf cc-pVTZ/C def2/J soscf
formula: C8H13
InChI: InChI=1/C8H13/c1-2-4-6-8-7-5-3-1/h1-2,7H,3-6,8H2
21 atoms
C  -1.99973 0.656657 0.075954
H  -2.176822 0.789625 1.149028
C  -1.776259 -0.9550 -0.171945
H  -2.634828 -1.422914 0.318592
C  -0.416015 -1.352295 0.371758
C  0.667402 -1.26164 -0.412993
C  1.972108 -0.707165 0.069147
H  2.160808 -0.937577 1.12277
H  2.836899 -1.035318 -0.517111
C  1.805138 0.834445 -0.11751
H  1.839896 1.093928 -1.181518
H  2.62014 1.373606 0.373017
C  0.449934 1.365511 0.502228
C  -0.734272 1.244879 -0.332138
H  0.51779 -1.210996 -1.495325
H  -1.842668 -1.141922 -1.247337
H  0.281986 0.970285 1.50603
H  -0.643446 1.603454 -1.362534
H  -2.853884 0.989091 -0.518579
H  0.590598 2.466192 0.586044
H  -0.313465 -1.419816 1.454982
totalener: -311.14400135 hartree
nucrepener: 379.38399888 hartree
electener: -690.52800024 hartree
oneelecener: -1159.17980486 hartree
twoeener: 468.65180462 hartree
kineticenergy: 309.71850831 hartree
exchangeener: -12.752547108084 hartree
correlationener: -0.942708995230 hartree
xcener: -13.695256103314 hartree
chargesum: 1.0000000
charge: -0.244164 0.192823 -0.243956 0.188999 -0.163420 -0.154858 -0.236747 0.163337 0.178454 -0.251012 0.160240 0.182037 -0.240073 0.094892 0.175537 0.178234 0.173946 0.243555 0.195940 0.215562 0.190676
charge: 0.110679 0.014742 0.125557 0.002456 0.047485 0.044098 0.069207 -0.002616 0.002317 0.113142 -0.008953 -0.000340 0.080807 0.351309 -0.018219 -0.001177 0.006649 0.023927 0.009433 0.050665 -0.021168
qa: -0.2442 0.1928 -0.2440 0.1890 -0.1634 -0.1549 -0.2367 0.1633 0.1785 -0.2510 0.1602 0.1820 -0.2401 0.0949 0.1755 0.1782 0.1739 0.2436 0.1959 0.2156 0.1907
va: 3.8665 0.9744 3.9153 0.9703 3.8259 3.8480 3.9031 0.9856 0.9764 3.8840 0.9824 0.9720 3.9189 3.5085 0.9798 0.9783 0.9877 0.9496 0.9751 0.9646 0.9790
energy: -311.842994079995
dipole: 0.35872 -1.03750 -0.67878 1.98254 -0.62888 1.35367 0.17605 -0.31539 -0.13934
magnitude: 1.52071 au
magnitude: 3.86535 debye
