program: Orca
programVersion: 5.0.3
elementType: C H C H C C C H H C H H C C H H H H H H H
charge: 1
multiplicity: 1
keywords: PBE0 cc-pVTZ EnGrad RIJCOSX verytightscf cc-pVTZ/C def2/J soscf
formula: C8H13
InChI: InChI=1/C8H13/c1-2-4-6-8-7-5-3-1/h1-2,7H,3-6,8H2
21 atoms
C  -1.995714 0.619816 0.080386
H  -2.173744 0.780445 1.150216
C  -1.801465 -0.951913 -0.171671
H  -2.642146 -1.457501 0.312543
C  -0.426537 -1.331167 0.363286
C  0.660328 -1.252599 -0.425011
C  1.959662 -0.703751 0.071182
H  2.139363 -0.941282 1.12474
H  2.826128 -1.034121 -0.511847
C  1.813858 0.841405 -0.110703
H  1.851199 1.099435 -1.175085
H  2.637603 1.368775 0.378356
C  0.464902 1.391504 0.506316
C  -0.711896 1.212663 -0.327357
H  0.521869 -1.236619 -1.509058
H  -1.859489 -1.145148 -1.247345
H  0.307196 1.028169 1.524064
H  -0.622986 1.555583 -1.363258
H  -2.838189 0.988864 -0.511719
H  0.61199 2.492117 0.546751
H  -0.314118 -1.387797 1.446669
totalener: -312.04742500 hartree
nucrepener: 379.76855867 hartree
electener: -691.81598366 hartree
oneelecener: -1160.55240697 hartree
twoeener: 468.73642330 hartree
kineticenergy: 309.63216868 hartree
exchangeener: -34.149907665718 hartree
correlationener: -1.961302807257 hartree
xcener: -36.111210472975 hartree
chargesum: 1.0000000
charge: -0.166186 0.161459 -0.177443 0.154076 -0.133228 -0.135735 -0.168405 0.139902 0.152346 -0.195044 0.138946 0.153454 -0.178594 0.074175 0.158027 0.149180 0.151266 0.208693 0.165463 0.186302 0.161345
charge: 0.099778 0.013448 0.105115 0.000901 0.071071 0.053194 0.071436 -0.000811 0.005994 0.114856 -0.007018 0.000462 0.076677 0.343120 -0.015571 0.000533 0.006739 0.019276 0.010303 0.048379 -0.017880
qa: -0.1662 0.1615 -0.1774 0.1541 -0.1332 -0.1357 -0.1684 0.1399 0.1523 -0.1950 0.1389 0.1535 -0.1786 0.0742 0.1580 0.1492 0.1513 0.2087 0.1655 0.1863 0.1613
va: 3.8338 0.9878 3.8890 0.9856 3.8228 3.8369 3.8811 0.9943 0.9879 3.8625 0.9906 0.9854 3.8922 3.5476 0.9897 0.9908 0.9955 0.9702 0.9869 0.9786 0.9932
energy: -312.047424995939
dipole: 0.41657 -0.92508 -0.50851 1.97624 -0.77492 1.20132 0.15445 -0.27717 -0.12272
magnitude: 1.31027 au
magnitude: 3.33045 debye
