program: Orca
programVersion: 5.0.3
elementType: C H C H C C C H H C H H C C H H H H H H H
charge: 1
multiplicity: 1
keywords: DSD-PBEP86/2013 cc-pVTZ EnGrad RIJCOSX verytightscf cc-pVTZ/C def2/J soscf
formula: C8H13
InChI: InChI=1/C8H13/c1-2-4-6-8-7-5-3-1/h1-2,7H,3-6,8H2
21 atoms
C  -1.998767 0.525524 0.118465
H  -2.178536 0.72308 1.178676
C  -1.969336 -1.00203 -0.167266
H  -2.677316 -1.597734 0.410584
C  -0.526339 -1.118052 0.277344
C  0.605474 -1.108227 -0.508868
C  1.905639 -0.645901 0.061507
H  2.001664 -0.953406 1.108222
H  2.755885 -1.045709 -0.497441
C  1.905503 0.920209 -0.02838
H  2.04572 1.219935 -1.073456
H  2.749065 1.323242 0.538101
C  0.562716 1.480067 0.486259
C  -0.534508 0.785526 -0.25628
H  0.526942 -1.293588 -1.579635
H  -2.091709 -1.218247 -1.232496
H  0.44942 1.372167 1.570025
H  -0.415347 0.853643 -1.340697
H  -2.701321 1.107428 -0.485736
H  0.5067 2.555129 0.255659
H  -0.374313 -1.068002 1.35661
totalener: -311.17939958 hartree
nucrepener: 386.18376086 hartree
electener: -697.36316044 hartree
oneelecener: -1172.57661622 hartree
twoeener: 475.21345578 hartree
kineticenergy: 309.74562110 hartree
exchangeener: -12.761531639744 hartree
correlationener: -0.948614019688 hartree
xcener: -13.710145659432 hartree
chargesum: 1.0000000
charge: -0.217998 0.169190 -0.240215 0.185760 -0.059466 -0.057018 -0.254180 0.166478 0.185117 -0.252306 0.162404 0.183554 -0.237207 -0.078478 0.226845 0.169519 0.164311 0.201226 0.184181 0.197011 0.201274
charge: 0.099316 0.000148 0.103027 -0.000446 0.123665 0.171504 0.082770 0.002230 0.007217 0.096791 -0.005787 0.000345 0.064386 0.215838 0.003704 0.000094 -0.001532 0.003052 0.000339 0.021627 0.011714
qa: -0.2180 0.1692 -0.2402 0.1858 -0.0595 -0.0570 -0.2542 0.1665 0.1851 -0.2523 0.1624 0.1836 -0.2372 -0.0785 0.2268 0.1695 0.1643 0.2012 0.1842 0.1970 0.2013
va: 3.8680 0.9856 3.8877 0.9762 3.7988 3.7823 3.9234 0.9832 0.9757 3.8943 0.9807 0.9721 3.8980 3.7513 0.9590 0.9856 0.9837 0.9773 0.9742 0.9673 0.9771
energy: -311.883588517665
dipole: 0.55932 -0.70633 -0.14700 1.85148 -1.82938 0.02210 0.19517 -0.35473 -0.15956
magnitude: 0.21808 au
magnitude: 0.55431 debye
