program: Orca
programVersion: 5.0.3
elementType: C H C H C C C H H C H H C C H H H H H H H
charge: 1
multiplicity: 1
keywords: DSD-PBEP86/2013 cc-pVTZ EnGrad RIJCOSX verytightscf cc-pVTZ/C def2/J soscf
formula: C8H13
InChI: InChI=1/C8H13/c1-2-4-6-8-7-5-3-1/h1-2,7H,3-6,8H2
21 atoms
C  -1.996704 0.532596 0.120007
H  -2.173758 0.723856 1.18198
C  -1.946693 -0.994356 -0.171541
H  -2.674962 -1.584656 0.387249
C  -0.512365 -1.154205 0.285966
C  0.613024 -1.133165 -0.500426
C  1.908489 -0.655441 0.066457
H  2.012124 -0.951945 1.115629
H  2.766164 -1.043977 -0.48953
C  1.888343 0.908652 -0.040395
H  2.005624 1.197804 -1.091488
H  2.737528 1.33018 0.50399
C  0.553603 1.481539 0.492915
C  -0.557641 0.851109 -0.269131
H  0.532133 -1.303606 -1.573597
H  -2.05699 -1.200573 -1.240358
H  0.434758 1.348633 1.572998
H  -0.427801 0.913687 -1.352502
H  -2.725754 1.091561 -0.475827
H  0.535185 2.565455 0.291178
H  -0.363521 -1.103872 1.365964
totalener: -311.17553857 hartree
nucrepener: 385.01024815 hartree
electener: -696.18578672 hartree
oneelecener: -1170.26454115 hartree
twoeener: 474.07875442 hartree
kineticenergy: 309.73603660 hartree
exchangeener: -12.759302789353 hartree
correlationener: -0.947501947040 hartree
xcener: -13.706804736393 hartree
chargesum: 1.0000000
charge: -0.223260 0.170498 -0.236050 0.185399 -0.070723 -0.078079 -0.252916 0.166150 0.184527 -0.251896 0.160882 0.183951 -0.237032 -0.055075 0.225130 0.168745 0.167138 0.207169 0.184726 0.200601 0.200114
charge: 0.093267 0.000692 0.097883 -0.000234 0.126845 0.153372 0.079613 0.001467 0.006891 0.097157 -0.005789 0.000211 0.063537 0.245069 0.000399 0.000409 -0.000219 0.003442 0.002541 0.025994 0.007453
qa: -0.2233 0.1705 -0.2361 0.1854 -0.0707 -0.0781 -0.2529 0.1661 0.1845 -0.2519 0.1609 0.1840 -0.2370 -0.0551 0.2251 0.1687 0.1671 0.2072 0.1847 0.2006 0.2001
va: 3.8686 0.9848 3.8874 0.9759 3.8059 3.7997 3.9229 0.9836 0.9758 3.8925 0.9810 0.9717 3.9016 3.7227 0.9601 0.9859 0.9830 0.9731 0.9742 0.9664 0.9768
energy: -311.879321784867
dipole: 0.56296 -0.75258 -0.18962 1.85581 -1.69647 0.15934 0.18322 -0.33109 -0.14787
magnitude: 0.28846 au
magnitude: 0.73321 debye
