program: Gaussian 09
title: 000051182
version: EM64L-G09RevD.01
frameworkgroup: C1[X(C19H28N2O2)]
method: RPBEPBE
basis: SDD
operation: Freq
keyword: #p
keyword: freq=noraman
keyword: PBEPBE/SDD
title: #p freq=noraman PBEPBE/SDD
converged: NO YES NO NO
title: Mulliken charges:
elementType: O O N N C C C C C C C C C C C C C C C C C C C H H H H H H H H H H H H H H H H H H H H H H H H H H H H
charge: -0.294660 -0.267146 -0.078942 -0.105728 -0.099946 -0.093576 -0.490486 -0.379529 -0.421487 -0.427755 -0.429648 -0.325938 0.130631 -0.377969 -0.347635 0.256762 -0.694628 -0.393932 -0.331480 -0.355862 -0.373165 0.324849 -0.538125 0.205476 0.202917 0.219915 0.214854 0.216817 0.173938 0.182603 0.214429 0.212250 0.260856 0.249246 0.220554 0.194447 0.176148 0.198537 0.218688 0.193407 0.189434 0.214638 0.217581 0.208413 0.258443 0.292367 0.240304 0.250167 0.223728 0.220734 0.244504
chargesum: 0.00000
title: Mulliken charges with hydrogens summed into heavy atoms:
elementType: O O N N C C C C C C C C C C C C C C C C C C C
charge: -0.294660 -0.267146 -0.078942 -0.105728 0.105530 0.109341 -0.055716 0.011225 -0.024455 0.045351 0.040152 0.044658 0.130631 0.039256 0.035206 0.256762 -0.053996 -0.135489 -0.039113 -0.115559 -0.122998 0.324849 0.150841
polarizability: 2.79651087e+02 -2.34249306e+01 2.07153951e+02 1.14616758e+00 -1.43882983e+01 1.90347610e+02
1716.lowfreq: -0.0004 0.0008 0.0010 2.8572 8.0843 9.2764 15.9251 28.1324 34.5384
frequency: 15.8235 27.9933 34.2152 44.6636 57.9983 73.1398 81.5542 93.4450 113.0647 135.0937 153.4586 175.9300 198.4403 226.5807 227.9528 245.1154 259.6782 273.5913 284.1483 298.4374 306.9188 317.0440 344.3707 362.8379 390.1054 397.5812 420.5511 435.6776 451.4249 461.8601 493.9144 531.0541 561.3222 580.6346 625.0231 662.9264 672.7994 695.3037 736.2366 744.8233 753.2528 776.6589 793.0485 806.5795 819.0656 823.6234 848.3955 882.4751 897.4345 901.2549 915.5259 918.6602 938.3389 950.7853 965.7501 977.4190 983.6376 988.5674 991.0546 998.9461 1008.4840 1028.2549 1071.2531 1079.9874 1081.1788 1100.4597 1108.6393 1112.4675 1113.2770 1118.9089 1126.6429 1143.3736 1148.1333 1155.0569 1157.5053 1177.5541 1195.5420 1214.8220 1227.8321 1235.7635 1245.1449 1252.7195 1259.6857 1276.3889 1286.1102 1293.9370 1298.2152 1300.6685 1318.6565 1322.5714 1328.8529 1338.5588 1344.8234 1353.3121 1354.7584 1365.7041 1368.4298 1377.9569 1389.3546 1395.3071 1409.3144 1416.5775 1437.4954 1459.7787 1463.6718 1467.8411 1468.2427 1469.2972 1472.5873 1474.7807 1476.3620 1477.0979 1480.7689 1486.6771 1491.1580 1499.5709 1540.3799 1577.9287 1618.4023 2799.2531 2806.5044 2823.8303 2918.4779 2937.6895 2960.6892 2962.4141 2973.2346 2973.5026 2977.3080 2988.8076 2992.4391 3000.5366 3005.6993 3006.9067 3033.8651 3037.0683 3045.7704 3048.7387 3070.0173 3072.3253 3073.8839 3087.5547 3125.3576 3130.1720 3144.6835 3161.0331 3167.3334
redmass: 3.9165 5.2934 2.1360 2.9606 3.1276 5.0112 3.1795 3.2067 2.7359 3.1799 3.1638 3.5212 2.8968 2.1415 1.1552 2.1285 2.0220 3.3835 3.5086 4.7728 3.2730 4.0750 2.2497 2.9003 3.0537 1.9881 2.8949 2.4470 2.8344 3.6526 3.8499 3.3849 3.9689 4.4153 6.7879 4.7774 4.7460 5.5677 1.0802 4.6583 4.3603 4.8544 1.2436 3.4706 1.8656 1.6717 1.6044 3.2440 1.6484 1.6082 1.6045 2.1604 1.3609 1.3989 1.9375 2.2123 2.6700 2.5324 2.8202 2.3722 2.3863 2.9492 2.2041 2.1320 1.5908 1.4371 1.3440 1.9867 1.2608 1.8702 1.9567 1.5593 2.1156 1.6604 1.5110 1.2366 1.1840 1.4423 3.0851 1.7538 1.5421 1.4287 1.8696 1.3762 1.1095 1.4308 1.5247 1.2912 2.0012 1.4772 1.3224 1.7512 1.4782 1.4747 1.4352 1.6797 3.0983 1.4071 1.2423 1.4000 2.8505 3.8432 1.1916 1.0797 1.0917 1.0759 1.0500 1.0828 1.0910 1.0778 1.0428 1.0780 1.0817 1.0890 1.0944 2.4756 8.7221 7.3565 6.3140 1.0718 1.0714 1.0697 1.0721 1.0705 1.0329 1.0585 1.0612 1.0386 1.0622 1.0840 1.0842 1.0847 1.0992 1.0853 1.0934 1.0980 1.1018 1.1039 1.1002 1.0908 1.1000 1.0888 1.0994 1.0899 1.0879 1.0950 1.0959
irintensity: 0.1385 1.7876 0.1400 2.7535 0.4339 2.8910 0.4121 0.9924 1.4497 1.7640 3.8859 2.0875 0.6644 1.7877 0.0844 1.0393 0.5912 0.8745 1.6987 3.9652 6.5065 7.1050 5.0278 1.6744 0.2777 2.1471 0.4951 3.2190 1.5563 0.8408 7.0479 6.3603 5.9795 30.9741 0.6675 1.3557 1.4554 16.1164 8.0769 5.8437 10.3220 7.1411 1.0109 14.4384 9.3139 9.0542 53.0619 2.8132 11.4176 7.6830 0.4434 5.5959 1.1955 2.0319 0.8828 4.4639 36.2566 65.1864 7.2402 1.0147 6.3086 0.3681 21.5346 10.6338 7.5048 2.7520 7.6138 17.3428 0.2741 13.7066 8.2633 11.1153 26.2783 3.8811 1.3556 116.1135 1.9299 6.8187 156.2080 31.0064 97.0238 6.5611 64.5707 2.7194 2.4987 15.1758 4.8830 1.7902 46.1219 5.8686 4.4286 22.6749 0.3416 5.9792 3.6082 6.8791 10.2031 7.2922 9.2515 2.3733 229.5032 1.4838 6.4466 6.0784 7.4793 3.9313 13.1170 3.7937 13.9012 44.9419 12.5784 9.9033 13.9200 14.5613 9.0226 36.2301 204.2039 37.2582 123.2256 62.4225 42.2119 308.9837 56.6122 69.2752 76.4575 26.8914 36.0452 23.1278 24.0778 13.6182 61.2262 101.3728 5.8293 79.3816 21.2653 48.1103 42.9726 47.2661 72.0253 11.9109 62.3555 11.1851 26.5121 0.4751 4.3305 7.2563 14.4495
temp: 298.150 k
press: 1.00000 atm
elementType: 8 8 7 7 6 6 6 6 6 6 6 6 6 6 6 6 6 6 6 6 6 6 6 1 1 1 1 1 1 1 1 1 1 1 1 1 1 1 1 1 1 1 1 1 1 1 1 1 1 1 1
symmnumber: 1
zpe: 1152796.5 jmol-1
zpe.correction: 0.439077 hartree
zpe.thermalcorrener: 0.461674 hartree
zpe.thermalcorrenthalpy: 0.462618 hartree
zpe.thermalcorrgfe: 0.385500 hartree
zpe.sumelectzpe: -998.989928 hartree
zpe.sumelectthermal: -998.967331 hartree
zpe.sumelectthermalent: -998.966387 hartree
zpe.sumelectthermalfe: -999.043504 hartree
dipole: 0.5009 -0.6118 -3.6404
dipole: 3.7253
quadrupole: -108.6786 -135.0593 -150.4192
quadrupole: -0.8490 -2.0752 4.3117
quadrupole: 22.7071 -3.6736 -19.0335 -0.8490 -2.0752 4.3117
hfenergy: -999.4290048 hartree
pointgroup: C01 [X(C19H28N2O2)]
dipole: -0.1042271 0.3296698 -1.4242732 debye
polarizability: 266.9297059|-36.5758509|218.682467|2.5623722|14.3852501|191.5404749 unknown
InChI: InChI=1S/C19H28N2O2/c1-3-4-9-20-11-15-10-16(12-20)14-21(13-15)19(22)17-5-7-18(23-2)8-6-17/h5-8,15-16H,3-4,9-14H2,1-2H3
charge 0 multiplicity 1
51 atoms
O  0.403537 1.276095 2.666769
O  4.543215 -1.970083 -1.025045
N  -2.293371 0.193951 -0.76241
N  -0.41541 2.013825 0.616601
C  -2.879067 2.388404 0.373742
C  -1.461935 2.386322 -1.662368
C  -2.625139 3.126784 -0.961117
C  -3.277363 0.918201 0.084314
C  -1.922535 0.946096 -1.985169
C  -1.629927 2.534437 1.278003
C  -0.190182 2.464978 -0.774141
C  -2.715597 -1.193483 -1.077206
C  0.499559 1.307537 1.391729
C  -2.773877 -2.124672 0.151621
C  -3.003913 -3.60028 -0.248954
C  1.583201 0.52373 0.699844
C  -3.115202 -4.53839 0.971928
C  2.901104 0.568162 1.210416
C  1.286076 -0.384104 -0.353916
C  3.92457 -0.232984 0.660021
C  2.289912 -1.202555 -0.899601
C  3.615871 -1.119833 -0.402951
C  5.920776 -1.950851 -0.527049
H  -3.725998 2.858406 0.91214
H  -1.216524 2.885641 -2.620774
H  -3.530171 3.113215 -1.5991
H  -2.363965 4.186939 -0.774439
H  -3.384045 0.37362 1.039332
H  -4.289271 0.926484 -0.406889
H  -2.781363 1.013134 -2.70741
H  -1.11407 0.390719 -2.501033
H  -1.496993 3.609753 1.530265
H  -1.740879 1.990752 2.230747
H  0.633455 1.884479 -1.216436
H  0.134919 3.530336 -0.751407
H  -1.977364 -1.606908 -1.79443
H  -3.710431 -1.208574 -1.599878
H  -3.585915 -1.813464 0.838099
H  -1.82415 -2.028864 0.713644
H  -2.170277 -3.937001 -0.898737
H  -3.927131 -3.677353 -0.86006
H  -3.271675 -5.588201 0.66268
H  -2.196242 -4.49897 1.586098
H  -3.963233 -4.246685 1.620013
H  3.115649 1.226731 2.058679
H  0.249121 -0.467797 -0.699512
H  4.937528 -0.169782 1.068352
H  2.073881 -1.919741 -1.697523
H  5.968401 -2.252117 0.537465
H  6.380197 -0.950656 -0.649955
H  6.45924 -2.684582 -1.144592
