program: Orca
programVersion: 5.0.3
elementType: C H C H C C C H H C H H C C H H H H H H H
charge: 1
multiplicity: 1
keywords: DSD-PBEP86 cc-pVTZ EnGrad RIJCOSX verytightscf cc-pVTZ/C def2/J soscf
formula: C8H13
InChI: InChI=1/C8H13/c1-2-4-6-8-7-5-3-1/h1-2,7H,3-6,8H2
21 atoms
C  -1.990543 0.558229 0.106697
H  -2.166454 0.741809 1.171262
C  -1.879219 -0.974948 -0.174862
H  -2.664704 -1.534652 0.33919
C  -0.471282 -1.250808 0.322189
C  0.632636 -1.198972 -0.468778
C  1.923572 -0.680235 0.072179
H  2.060033 -0.947555 1.125366
H  2.791743 -1.038542 -0.489889
C  1.847255 0.87517 -0.07558
H  1.913282 1.143654 -1.136695
H  2.695725 1.348638 0.42648
C  0.518708 1.460609 0.509344
C  -0.628586 1.044067 -0.304641
H  0.531239 -1.302022 -1.54962
H  -1.95612 -1.171886 -1.248984
H  0.383102 1.227247 1.569082
H  -0.50331 1.201415 -1.380132
H  -2.784092 1.032735 -0.481952
H  0.605158 2.560161 0.414391
H  -0.334515 -1.235323 1.405064
totalener: -311.16094058 hartree
nucrepener: 381.89273179 hartree
electener: -693.05367237 hartree
oneelecener: -1164.11995499 hartree
twoeener: 471.06628262 hartree
kineticenergy: 309.72218701 hartree
exchangeener: -12.754888511162 hartree
correlationener: -0.944655383336 hartree
xcener: -13.699543894498 hartree
chargesum: 1.0000000
charge: -0.230443 0.176991 -0.229970 0.183964 -0.108385 -0.134182 -0.246061 0.165847 0.182569 -0.249805 0.158920 0.183951 -0.236790 0.013212 0.212751 0.167661 0.173762 0.225674 0.187047 0.209772 0.193514
charge: 0.087276 0.004309 0.090642 0.000040 0.112232 0.097298 0.072376 -0.000410 0.006212 0.103584 -0.006557 -0.000016 0.066940 0.319465 -0.009094 0.000625 0.003093 0.011502 0.008208 0.037609 -0.005335
qa: -0.2304 0.1770 -0.2300 0.1840 -0.1084 -0.1342 -0.2461 0.1658 0.1826 -0.2498 0.1589 0.1840 -0.2368 0.0132 0.2128 0.1677 0.1738 0.2257 0.1870 0.2098 0.1935
va: 3.8622 0.9812 3.8951 0.9746 3.8279 3.8355 3.9153 0.9843 0.9761 3.8868 0.9820 0.9714 3.9095 3.6201 0.9671 0.9857 0.9827 0.9600 0.9749 0.9648 0.9786
energy: -311.862060104708
dipole: 0.53515 -0.87368 -0.33853 1.89627 -1.22007 0.67619 0.15308 -0.28525 -0.13217
magnitude: 0.76767 au
magnitude: 1.95125 debye
