program: Orca
programVersion: 5.0.3
elementType: C H C H C C C H H C H H C C H H H H H H H
charge: 1
multiplicity: 1
keywords: DSD-PBEP86/2013 cc-pVTZ EnGrad RIJCOSX verytightscf cc-pVTZ/C def2/J soscf
formula: C8H13
InChI: InChI=1/C8H13/c1-2-4-6-8-7-5-3-1/h1-2,7H,3-6,8H2
21 atoms
C  -1.990158 0.561911 0.10408
H  -2.166255 0.744532 1.168996
C  -1.871696 -0.972793 -0.174767
H  -2.662988 -1.528395 0.335146
C  -0.466775 -1.259927 0.326631
C  0.635016 -1.205495 -0.464569
C  1.926138 -0.682851 0.072405
H  2.066877 -0.94691 1.125825
H  2.794631 -1.038061 -0.491389
C  1.843477 0.871502 -0.079618
H  1.905184 1.138169 -1.141403
H  2.690495 1.350657 0.419554
C  0.514009 1.45584 0.510311
C  -0.636803 1.064214 -0.307721
H  0.530473 -1.298654 -1.546192
H  -1.945343 -1.169653 -1.249171
H  0.376769 1.209238 1.566677
H  -0.51545 1.241889 -1.380657
H  -2.789643 1.026227 -0.484554
H  0.610295 2.556018 0.428523
H  -0.331896 -1.250905 1.409768
totalener: -311.15933098 hartree
nucrepener: 381.60477607 hartree
electener: -692.76410705 hartree
oneelecener: -1163.55259235 hartree
twoeener: 470.78848530 hartree
kineticenergy: 309.72179452 hartree
exchangeener: -12.754609330273 hartree
correlationener: -0.944408388352 hartree
xcener: -13.699017718625 hartree
chargesum: 1.0000000
charge: -0.230210 0.177854 -0.230165 0.183797 -0.113580 -0.138420 -0.245233 0.165882 0.182357 -0.249523 0.158945 0.183887 -0.236614 0.020200 0.210398 0.167686 0.174083 0.227819 0.187317 0.210653 0.192866
charge: 0.087587 0.005021 0.090712 0.000107 0.108627 0.091358 0.071860 -0.000578 0.006140 0.104791 -0.006709 -0.000012 0.067806 0.326110 -0.010057 0.000598 0.003400 0.012679 0.008634 0.038723 -0.006797
qa: -0.2302 0.1779 -0.2302 0.1838 -0.1136 -0.1384 -0.2452 0.1659 0.1824 -0.2495 0.1589 0.1839 -0.2366 0.0202 0.2104 0.1677 0.1741 0.2278 0.1873 0.2107 0.1929
va: 3.8611 0.9807 3.8970 0.9744 3.8299 3.8380 3.9143 0.9844 0.9761 3.8862 0.9821 0.9714 3.9101 3.6075 0.9681 0.9855 0.9829 0.9587 0.9750 0.9646 0.9788
energy: -311.860114947678
dipole: 0.52770 -0.88431 -0.35660 1.90422 -1.16331 0.74091 0.15079 -0.28299 -0.13219
magnitude: 0.83282 au
magnitude: 2.11685 debye
