program: Gaussian 09
title: 000051127
version: EM64L-G09RevD.01
frameworkgroup: C1[X(C12H4Cl4O)]
method: RPBEPBE
basis: SDD
operation: Freq
keyword: #p
keyword: freq=noraman
keyword: PBEPBE/SDD
title: #p freq=noraman PBEPBE/SDD
converged: YES YES NO YES
title: Mulliken charges:
elementType: Cl Cl Cl Cl O C C C C C C C C C C C C H H H H
charge: 0.036937 0.036939 -0.003464 -0.003464 -0.242765 0.379070 0.379071 0.152986 0.152987 -0.285487 -0.285489 -0.360875 -0.360874 -0.134187 -0.134187 -0.203916 -0.203916 0.272040 0.272040 0.268277 0.268277
chargesum: 0.00000
title: Mulliken charges with hydrogens summed into heavy atoms:
elementType: Cl Cl Cl Cl O C C C C C C C C C C C C
charge: 0.036937 0.036939 -0.003464 -0.003464 -0.242765 0.379070 0.379071 0.152986 0.152987 -0.285487 -0.285489 -0.088835 -0.088835 -0.134187 -0.134187 0.064361 0.064361
polarizability: 2.72730457e+02 3.94247488e-06 1.96412099e+02 2.54334114e-02 1.12301739e-05 6.04146048e+01
1716.lowfreq: -2.7842 -0.0022 -0.0016 0.0006 2.9612 5.4935 18.3616 45.8553 87.0637
frequency: 18.2414 45.8546 87.0633 126.8778 162.6110 177.6412 197.7906 219.4608 237.1008 275.4629 278.4929 317.9766 358.2910 368.4760 378.5050 425.6081 462.5699 495.6191 530.8610 532.2395 563.0163 589.0791 599.9335 657.9742 690.2806 694.3228 718.7813 758.4622 803.7862 807.9294 818.8252 887.7600 904.2527 939.1600 939.7136 1011.2522 1112.6200 1119.5639 1121.2164 1152.3555 1175.9619 1226.0790 1234.3809 1355.0822 1376.1849 1379.6868 1391.5972 1411.0514 1438.0202 1550.8499 1563.4642 1593.6970 1631.4975 3174.5555 3174.7693 3193.4106 3193.4930
redmass: 18.3477 23.8128 8.8449 25.4678 6.0733 23.3916 8.9705 22.0663 30.0153 20.5634 6.2881 5.9434 17.0228 8.9640 9.4117 11.2923 8.3251 4.3870 7.9178 4.5798 5.5661 5.5826 5.5948 10.5826 8.9198 8.6598 7.0502 9.1233 1.3855 1.3977 7.5552 10.4338 9.6918 1.3316 1.3339 8.6352 1.7726 1.3797 3.8680 2.6587 2.2062 3.2481 4.3382 5.1124 3.6252 6.2810 3.9192 3.1095 6.6443 7.3701 7.4898 8.8292 9.1352 1.0891 1.0892 1.0985 1.0986
irintensity: 0.0000 0.0308 0.0000 0.1674 3.7635 0.1616 1.6640 0.1757 0.0322 0.0017 0.0000 0.0000 3.1086 4.4554 0.0716 0.1013 15.6916 2.3304 0.2216 0.0000 6.1755 7.4554 0.0000 69.8240 1.0245 1.9814 0.5510 0.0000 0.0000 109.8388 18.1551 42.1234 4.4946 0.0000 0.7899 105.3731 2.9712 3.9133 62.5615 2.6830 0.0036 116.6805 1.8819 24.9964 4.8332 0.9345 119.8333 111.6280 6.3869 7.0784 4.5963 6.2575 0.5942 0.0052 0.0085 0.0826 0.5134
temp: 298.150 k
press: 1.00000 atm
elementType: 17 17 17 17 8 6 6 6 6 6 6 6 6 6 6 6 6 1 1 1 1
symmnumber: 1
zpe: 320903.1 jmol-1
zpe.correction: 0.122226 hartree
zpe.thermalcorrener: 0.136288 hartree
zpe.thermalcorrenthalpy: 0.137232 hartree
zpe.thermalcorrgfe: 0.079121 hartree
zpe.sumelectzpe: -2373.968586 hartree
zpe.sumelectthermal: -2373.954523 hartree
zpe.sumelectthermalent: -2373.953579 hartree
zpe.sumelectthermalfe: -2374.011691 hartree
dipole: 0.0000 4.0788 0.0000
dipole: 4.0788
quadrupole: -119.0959 -117.2062 -126.7647
quadrupole: 0.0000 0.0064 0.0001
quadrupole: 1.9263 3.8161 -5.7424 0.0000 0.0064 0.0001
hfenergy: -2374.0908117 hartree
pointgroup: C01 [X(C12H4Cl4O1)]
dipole: -0.0000829 -1.604725 -0.000111 debye
dipolederiv: -0.0364517 0.0918653 0.0001618 -0.0611543 -0.592185 -0.0004348 0.0000081 -0.0007219 0.0010956 -0.0364535 -0.0919218 0.0001486 0.0610982 -0.5921819 0.0003486 0.0000178 0.0006272 0.001097 -0.5894581 -0.2702868 0.0010698 -0.3890042 -0.2426699 0.0007405 0.0009955 0.0004394 -0.0308855 -0.5893917 0.2703216 0.0011191 0.3890389 -0.2427365 -0.0007775 0.0010681 -0.0004775 -0.0308861 -1.297225 0.0000365 0.0023744 0.0000362 -0.5302156 -0.00003 0.0024323 -0.0000292 -0.1455649 0.1355433 0.1343515 -0.0000777 -0.1718667 -0.3014941 0.0001173 -0.0000154 -0.0004783 0.0396476 0.1355515 -0.1343939 -0.000095 0.1718209 -0.3014967 -0.000168 0.0000142 0.0004275 0.0396483 0.6170521 0.2084194 -0.0011946 0.6044442 0.2860226 -0.0012453 -0.0012021 -0.0004634 0.0816536 0.6169714 -0.2084504 -0.0012274 -0.6044751 0.2861027 0.001275 -0.0012938 0.0004933 0.0816536 0.0509531 -0.2577263 -0.0003888 0.0254894 0.8649064 0.0009678 -0.000303 0.001457 -0.0475164 0.0509722 0.2578089 -0.0003515 -0.0254052 0.8648826 -0.0008358 -0.000305 -0.0013144 -0.0475175 -0.0640958 -0.120321 -0.0002339 -0.0688474 -0.0008651 0.0001112 -0.0002491 0.0002652 -0.1692436 -0.0640775 0.1203254 -0.0002192 0.0688546 -0.0008848 -0.0000861 -0.0002421 -0.000244 -0.1692434 0.6747951 0.5238251 -0.0013352 0.7756098 0.1225164 -0.001671 -0.0011726 -0.001157 -0.061811 0.6746674 -0.5238822 -0.0014293 -0.7756634 0.1226488 0.0017123 -0.0013086 0.0011944 -0.0618102 -0.2176494 -0.0175377 0.0002221 -0.2093023 0.0526678 0.0005015 0.0000871 0.0000898 -0.0945603 -0.2176272 0.0175662 0.0002234 0.2093264 0.052644 -0.0004847 0.0001229 -0.0000698 -0.0945606 0.0887018 -0.0075791 0.000217 0.0201644 -0.0112173 -0.0000871 0.0002593 -0.000011 0.1877529 0.0887006 0.0075694 0.0002195 -0.0201743 -0.0112153 0.0000578 0.0002583 -0.0000167 0.1877529 -0.0107369 0.0374077 0.0003995 0.0162573 0.0873827 -0.0000721 0.0004139 -0.000079 0.1666489 -0.0107419 -0.0373979 0.0003973 -0.0162477 0.0873882 0.0000604 0.0004142 0.0000684 0.1666491 unknown
polarizability: 272.7295541|-0.0037907|196.4120987|-0.4386081|0.0102637|60.4155086 unknown
InChI: InChI=1S/C12H4Cl4O/c13-5-1-3-7-9(11(5)15)10-8(17-7)4-2-6(14)12(10)16/h1-4H
charge 0 multiplicity 1
21 atoms
Cl 1.595857 2.689644 -0.001253
Cl -1.595623 2.689801 0.001408
Cl 4.564321 1.561686 -0.008972
Cl -4.564201 1.562144 0.009022
O  -0.000131 -2.259679 -0.000291
C  0.74252 -0.02602 -0.00164
C  -0.74256 -0.025947 0.00138
C  1.120155 -1.411631 -0.002712
C  -1.120334 -1.411519 0.002256
C  1.826429 0.90377 -0.003373
C  -1.826375 0.903953 0.003254
C  2.42624 -1.90951 -0.005671
C  -2.426469 -1.909268 0.005155
C  3.156942 0.417836 -0.006514
C  -3.156937 0.418152 0.006355
C  3.464297 -0.962972 -0.007716
C  -3.464431 -0.962625 0.007361
H  2.618525 -2.984336 -0.006314
H  -2.618861 -2.984075 0.005645
H  4.510649 -1.277978 -0.010099
H  -4.510814 -1.277527 0.009721
