program: Orca
programVersion: 5.0.3
elementType: C H C H C C C H H C H H C C H H H H H H H
charge: 1
multiplicity: 1
keywords: DSD-PBEP86 def2-TZVP RIJCOSX verytightscf def2-TZVP/C def2/J soscf noTRAH
formula: C8H13
InChI: InChI=1/C8H13/c1-2-4-6-8-7-5-3-1/h1-2,7H,3-6,8H2
21 atoms
C  -1.996975 0.518036 0.098601
H  -2.187666 0.747785 1.150253
C  -1.996188 -1.015746 -0.146621
H  -2.682987 -1.597653 0.468833
C  -0.542865 -1.086784 0.278775
C  0.586157 -1.071387 -0.521172
C  1.901934 -0.631349 0.041056
H  2.002501 -0.969803 1.077878
H  2.733866 -1.039923 -0.538396
C  1.930933 0.935625 -0.001964
H  2.113469 1.266311 -1.030737
H  2.756913 1.307351 0.610034
C  0.571037 1.47347 0.482542
C  -0.502978 0.715989 -0.250467
H  0.49846 -1.273147 -1.58798
H  -2.139135 -1.267592 -1.201136
H  0.452758 1.384056 1.56773
H  -0.392002 0.802993 -1.334772
H  -2.6631 1.110344 -0.534304
H  0.474935 2.538443 0.229253
H  -0.379216 -1.040052 1.356098
totalener: -311.18615252 hartree
nucrepener: 387.38781538 hartree
electener: -698.57396790 hartree
oneelecener: -1174.98286351 hartree
twoeener: 476.40889561 hartree
kineticenergy: 310.03156528 hartree
exchangeener: -12.767184265761 hartree
correlationener: -0.950125029077 hartree
xcener: -13.717309294838 hartree
chargesum: 1.0000000
charge: -0.195358 0.164076 -0.194852 0.178525 -0.064313 -0.035160 -0.224483 0.160355 0.178334 -0.239270 0.153238 0.172113 -0.213811 -0.058009 0.211504 0.159618 0.146502 0.169914 0.173659 0.174290 0.183127
charge: -0.180780 0.152376 -0.177210 0.149207 -0.059886 0.007557 -0.200093 0.155984 0.157427 -0.206913 0.146054 0.150359 -0.222246 -0.006984 0.168104 0.151642 0.149532 0.174445 0.147932 0.166717 0.176776
qa: -0.1954 0.1641 -0.1949 0.1785 -0.0643 -0.0352 -0.2245 0.1604 0.1783 -0.2393 0.1532 0.1721 -0.2138 -0.0580 0.2115 0.1596 0.1465 0.1699 0.1737 0.1743 0.1831
va: 3.8717 0.9746 3.8787 0.9724 3.8481 3.7652 3.9039 0.9670 0.9679 3.8855 0.9712 0.9690 3.9220 3.7574 0.9409 0.9738 0.9731 0.9627 0.9710 0.9678 0.9584
total: -311.871030045 hartree
energy: -311.871030045031
dipole: 0.55177 -0.68626 -0.13449 1.84321 -1.96970 -0.12650 0.21798 -0.41815 -0.20016
magnitude: 0.27232 au
magnitude: 0.69217 debye
