program: Orca
programVersion: 5.0.3
elementType: C H C H C C C H H C H H C C H H H H H H H
charge: 1
multiplicity: 1
keywords: DSD-PBEP86/2013 cc-pVTZ EnGrad D3BJ RIJCOSX verytightscf cc-pVTZ/C def2/J soscf
formula: C8H13
InChI: InChI=1/C8H13/c1-2-4-6-8-7-5-3-1/h1-2,7H,3-6,8H2
21 atoms
C  -1.9941 0.541562 0.117355
H  -2.169777 0.729399 1.180414
C  -1.920344 -0.986411 -0.173882
H  -2.671897 -1.566521 0.365635
C  -0.496189 -1.194793 0.29888
C  0.620616 -1.160216 -0.489484
C  1.912981 -0.665514 0.069653
H  2.028051 -0.950682 1.120781
H  2.776511 -1.041601 -0.486546
C  1.870692 0.895492 -0.05375
H  1.965376 1.175519 -1.109749
H  2.722325 1.337546 0.470537
C  0.541428 1.477991 0.500447
C  -0.584781 0.927844 -0.284228
H  0.533593 -1.308779 -1.56561
H  -2.017013 -1.186374 -1.245506
H  0.415453 1.310311 1.574474
H  -0.449312 1.00548 -1.366175
H  -2.750733 1.069647 -0.473587
H  0.566326 2.570198 0.337476
H  -0.351106 -1.152379 1.379958
totalener: -311.16143103 hartree
nucrepener: 383.70186791 hartree
electener: -694.86329895 hartree
oneelecener: -1167.69852988 hartree
twoeener: 472.83523093 hartree
kineticenergy: 309.73176402 hartree
exchangeener: -14.123812433936 hartree
correlationener: -0.946139087667 hartree
xcener: -15.069951521603 hartree
chargesum: 1.0000000
charge: -0.223496 0.170341 -0.227892 0.182613 -0.081809 -0.100194 -0.245711 0.163334 0.181378 -0.246257 0.156972 0.181746 -0.232284 -0.023678 0.219229 0.165692 0.167780 0.211791 0.183425 0.201732 0.195289
charge: 0.089927 0.001134 0.094280 -0.000659 0.125701 0.132288 0.077210 0.000104 0.005979 0.099445 -0.006505 -0.000462 0.064813 0.277907 -0.003942 0.000059 0.000704 0.005329 0.004559 0.030160 0.001967
qa: -0.2235 0.1703 -0.2279 0.1826 -0.0818 -0.1002 -0.2457 0.1633 0.1814 -0.2463 0.1570 0.1817 -0.2323 -0.0237 0.2192 0.1657 0.1678 0.2118 0.1834 0.2017 0.1953
va: 3.8646 0.9843 3.8859 0.9764 3.8123 3.8140 3.9176 0.9848 0.9768 3.8873 0.9823 0.9724 3.9023 3.6804 0.9634 0.9868 0.9833 0.9694 0.9752 0.9666 0.9782
dispcorr: -0.014278400 hartree
energy: -311.849548012301
dipole: 0.56021 -0.80720 -0.24700 1.86445 -1.52213 0.34233 0.17048 -0.30951 -0.13903
magnitude: 0.44444 au
magnitude: 1.12967 debye
