program: Gaussian 09
title: 000051140
version: EM64L-G09RevD.01
frameworkgroup: C1[X(C16H28NS)]
method: RPBEPBE
basis: SDD
operation: Freq
keyword: #p
keyword: freq=noraman
keyword: PBEPBE/SDD
title: #p freq=noraman PBEPBE/SDD
converged: YES YES NO NO
title: Mulliken charges:
elementType: S N C C C C C C C C C C C C C C C C H H H H H H H H H H H H H H H H H H H H H H H H H H H H
charge: 0.232026 -0.033375 -0.378064 -0.371561 -0.368962 -0.353432 -0.351786 -0.355863 -0.672376 -0.690962 -0.641390 -0.290065 -0.289237 0.430782 0.430713 -0.355010 -0.772875 -0.772911 0.198539 0.198616 0.199609 0.199732 0.192825 0.192725 0.190825 0.190783 0.227257 0.227164 0.196217 0.196244 0.273377 0.273449 0.289451 0.289972 0.222375 0.210770 0.210765 0.296924 0.297643 0.282991 0.265222 0.264256 0.243575 0.243606 0.265083 0.264357
chargesum: 1.00000
title: Mulliken charges with hydrogens summed into heavy atoms:
elementType: S N C C C C C C C C C C C C C C C C
charge: 0.232026 -0.033375 0.019092 0.013988 0.030379 0.028176 0.102635 0.036597 -0.125551 -0.047053 -0.061968 0.006859 0.008406 0.430782 0.430713 -0.072019 0.000178 0.000135
polarizability: 3.14024127e+02 -1.02073444e-01 1.81230090e+02 -1.55594896e+01 -1.73517213e-02 1.45631382e+02
1716.lowfreq: -4.5726 -0.0017 0.0004 0.0011 5.3021 6.3902 14.0367 25.4609 28.2998
frequency: 3.6806 25.4582 28.1153 40.0390 52.2192 56.2391 57.3842 64.8413 65.9552 94.2658 102.3957 111.4669 143.5411 144.6126 151.3667 182.5515 193.1563 229.3935 230.0561 251.3179 273.3687 283.8858 294.5968 350.8305 436.5940 464.6440 470.7972 508.1085 510.0892 518.7851 529.9185 604.2572 664.5088 678.1943 725.0226 732.9766 733.1185 752.8529 788.3820 852.4571 874.8327 880.8243 890.5126 904.6390 930.9934 938.0790 957.5623 967.4642 987.1452 1003.0000 1013.2039 1016.6723 1025.1469 1031.0200 1039.2128 1049.4477 1059.7536 1060.5800 1072.7473 1072.8250 1079.4213 1118.5084 1152.1920 1175.4595 1185.7654 1196.9049 1214.0747 1221.1125 1244.0883 1258.5823 1273.9604 1283.8788 1285.4712 1293.0321 1297.4098 1301.2924 1317.0167 1323.1380 1324.0871 1342.1942 1352.8611 1356.4204 1376.6637 1394.5061 1407.4402 1410.4942 1421.2277 1445.6400 1463.1849 1463.2932 1463.6426 1464.1941 1465.6066 1467.1130 1470.2809 1472.0918 1478.5917 1478.8044 1485.1209 1489.3396 1489.6345 1492.4088 1593.0420 1617.1279 2953.9526 2956.7905 2960.7178 2967.1219 2971.5034 2976.0262 2989.0707 2989.6641 2997.4296 2997.6853 2999.2503 3010.2529 3011.0303 3026.4063 3040.3111 3041.0983 3053.4957 3071.7879 3076.6778 3080.3985 3080.5663 3093.2835 3109.9894 3110.2339 3116.9275 3147.8338 3190.6883 3195.5722
redmass: 4.2232 4.4248 3.8964 1.8531 3.9121 1.1321 1.2180 2.1401 2.0149 2.3123 4.6849 1.9632 2.0780 4.5018 2.0127 3.3403 3.5000 2.8058 1.1305 3.4413 3.4066 2.3841 3.5478 3.8779 3.2211 2.4532 3.1135 4.5927 2.8582 5.1505 4.8951 4.8636 5.6243 2.6235 1.0626 1.0801 4.3428 1.1051 1.1644 1.2185 1.5456 1.3886 1.8960 1.4375 1.2485 3.2553 1.3348 2.6893 4.8385 1.1572 3.8459 2.3002 3.4324 1.4969 3.3976 1.5329 1.6014 3.0022 1.4198 1.6613 2.2503 2.5704 1.3688 1.8392 1.7821 1.3331 1.2358 1.4453 1.2361 1.2820 1.2543 1.0253 1.1681 1.3139 1.0785 1.1152 2.3559 1.6000 1.2734 1.4234 1.5374 1.6445 4.2277 1.2156 1.2556 1.2611 2.0436 1.0893 1.0748 1.2584 1.0704 1.0437 1.0902 1.0688 1.0907 1.0781 1.0782 1.0419 1.0896 1.1975 1.1018 1.9005 5.3407 4.6036 1.0590 1.0589 1.0591 1.0593 1.0589 1.0363 1.0589 1.0974 1.0382 1.0382 1.0995 1.1023 1.0551 1.1043 1.1047 1.0559 1.1051 1.1007 1.0993 1.0979 1.0979 1.1101 1.0998 1.0997 1.1124 1.0937 1.0939 1.0973
irintensity: 0.0035 0.2149 0.2703 0.7635 2.2058 0.6503 0.8822 0.7496 0.7061 0.6831 1.9876 0.2134 0.2134 0.0921 0.0071 1.1578 1.1103 0.0120 0.0002 0.4907 0.2067 0.3620 1.3806 2.2861 0.0721 0.1743 1.3169 1.0671 0.0044 0.7651 1.4579 0.9792 21.5375 24.0214 13.8970 1.2863 12.4225 6.5944 0.0008 0.9506 19.3229 0.2411 5.8115 1.6453 0.1132 4.0735 0.6592 2.1397 0.0955 0.4857 2.5963 0.8176 6.4105 0.2834 0.5002 0.0300 24.4819 2.4351 0.0668 0.1065 1.4924 35.3138 0.4666 46.8591 0.1095 0.0443 6.3139 0.0202 17.2858 0.0324 13.6751 1.3188 0.1092 1.1971 0.0249 0.0864 2.1619 20.8260 0.0181 13.7705 0.1809 0.2416 13.1383 11.0877 15.4687 35.3400 11.4725 10.8276 0.1697 0.2672 2.6804 40.2624 0.1346 6.5020 12.4651 1.4075 1.7527 13.4397 2.4302 22.0888 32.2118 56.9128 39.5660 2.7273 0.0527 3.0328 0.1645 1.7594 147.2993 39.5992 22.2586 0.0975 1.8035 0.3655 0.1688 0.8443 30.2326 0.7164 63.4798 13.6157 72.1201 88.6692 48.0291 2.6975 3.1067 33.4730 11.6556 3.8646 0.7061 0.3946 2.5452 0.6522
temp: 298.150 k
press: 1.00000 atm
elementType: 16 7 6 6 6 6 6 6 6 6 6 6 6 6 6 6 6 6 1 1 1 1 1 1 1 1 1 1 1 1 1 1 1 1 1 1 1 1 1 1 1 1 1 1 1 1
symmnumber: 1
zpe: 1066466.0 jmol-1
zpe.correction: 0.406195 hartree
zpe.thermalcorrener: 0.428963 hartree
zpe.thermalcorrenthalpy: 0.429907 hartree
zpe.thermalcorrgfe: 0.348097 hartree
zpe.sumelectzpe: -1077.664152 hartree
zpe.sumelectthermal: -1077.641385 hartree
zpe.sumelectthermalent: -1077.640441 hartree
zpe.sumelectthermalfe: -1077.722251 hartree
dipole: 17.2310 0.0017 2.0195
dipole: 17.3490
quadrupole: 4.7849 -99.3079 -114.2191
quadrupole: 0.0192 -4.1760 -0.0342
quadrupole: 74.3656 -29.7272 -44.6384 0.0192 -4.1760 -0.0342
hfenergy: -1078.0703479 hartree
pointgroup: C01 [X(C16H28N1S1)]
dipole: -6.7771515 -0.024915 -0.8115638 debye
polarizability: 314.0977447|0.7056787|181.2331665|-15.1358343|0.071368|145.5546875 unknown
InChI: InChI=1S/C16H28NS/c1-4-5-6-7-8-9-10-18-14-17-12-15(2)11-16(3)13-17/h11-13H,4-10,14H2,1-3H3
charge 1 multiplicity 1
46 atoms
S  -0.777407 -0.024588 0.247677
N  -3.384284 -0.030651 -0.639383
C  4.605171 0.010427 0.364039
C  5.949917 0.018848 -0.398062
C  3.380194 0.006161 -0.579531
C  7.178842 0.022363 0.539042
C  2.037441 -0.004215 0.194872
C  8.524111 0.029968 -0.222903
C  0.840941 -0.009171 -0.771266
C  9.747154 0.033004 0.718988
C  -2.00385 -0.036179 -1.197724
C  -3.997817 -1.227792 -0.352733
C  -3.987285 1.171899 -0.352788
C  -5.278795 -1.26233 0.231079
C  -5.268098 1.217746 0.230425
C  -5.902996 -0.019542 0.514348
C  -5.949479 -2.581376 0.538392
C  -5.927784 2.542661 0.536222
H  4.564674 -0.879811 1.025107
H  4.555674 0.897325 1.028985
H  3.433807 -0.881417 -1.243101
H  3.423416 0.898097 -1.237958
H  5.992711 0.90903 -1.05989
H  6.001191 -0.867689 -1.064192
H  7.132624 0.908867 1.205574
H  7.140483 -0.867331 1.201797
H  1.997819 -0.897263 0.848349
H  1.98667 0.884706 0.853225
H  8.570808 -0.855752 -0.88897
H  8.563135 0.919119 -0.884872
H  0.844309 -0.911094 -1.408084
H  0.831195 0.897164 -1.401739
H  -1.867254 -0.943055 -1.807315
H  -1.865301 0.860667 -1.821661
H  10.694839 0.038457 0.150657
H  9.741933 0.924319 1.374289
H  9.749583 -0.861466 1.369982
H  -3.436219 -2.132739 -0.593365
H  -3.417252 2.071696 -0.592861
H  -6.900742 -0.015142 0.968582
H  -6.191807 -2.657367 1.613489
H  -6.89975 -2.678779 -0.016794
H  -5.313862 -3.441662 0.274216
H  -5.281993 3.397175 0.278055
H  -6.176709 2.618839 1.609759
H  -6.873261 2.650573 -0.02526
