program: Orca
programVersion: 5.0.3
elementType: C H C H C C C H H C H H C C H H H H H H H
charge: 1
multiplicity: 1
keywords: b3lyp cc-pVTZ EnGrad D3BJ RIJCOSX verytightscf cc-pVTZ/C def2/J soscf
formula: C8H13
InChI: InChI=1/C8H13/c1-2-4-6-8-7-5-3-1/h1-2,7H,3-6,8H2
21 atoms
C  -1.993575 0.517628 0.081752
H  -2.19156 0.771242 1.126454
C  -1.999331 -1.020671 -0.130344
H  -2.68253 -1.586029 0.504054
C  -0.543853 -1.087089 0.28625
C  0.576355 -1.061847 -0.526112
C  1.900809 -0.628689 0.026065
H  2.013568 -0.987913 1.054619
H  2.723826 -1.0304 -0.570456
C  1.935416 0.938196 0.013153
H  2.133881 1.287533 -1.006274
H  2.752998 1.296329 0.644022
C  0.569886 1.471017 0.487039
C  -0.4948 0.709886 -0.258055
H  0.478851 -1.270649 -1.590526
H  -2.151511 -1.296726 -1.177335
H  0.441201 1.376876 1.570711
H  -0.376144 0.802088 -1.341069
H  -2.653109 1.098123 -0.568552
H  0.471702 2.536504 0.237398
H  -0.370664 -1.034794 1.361771
totalener: -312.25282650 hartree
nucrepener: 387.49965621 hartree
electener: -699.75248271 hartree
oneelecener: -1175.78432372 hartree
twoeener: 476.03184101 hartree
kineticenergy: 310.02040480 hartree
exchangeener: -36.334561694524 hartree
correlationener: -2.310773304987 hartree
xcener: -38.645334999511 hartree
chargesum: 1.0000000
charge: -0.159703 0.142271 -0.183610 0.155638 -0.006784 -0.013165 -0.189933 0.137100 0.153941 -0.192389 0.135476 0.150597 -0.175291 -0.058164 0.189101 0.140307 0.130037 0.162635 0.153132 0.160179 0.168626
charge: 0.113280 -0.001618 0.113237 -0.002443 0.125016 0.181402 0.090704 0.001348 0.005272 0.100980 -0.007619 -0.001431 0.071676 0.185410 0.003606 -0.002185 -0.005079 0.003583 -0.003749 0.014875 0.013736
qa: -0.1597 0.1423 -0.1836 0.1556 -0.0068 -0.0132 -0.1899 0.1371 0.1539 -0.1924 0.1355 0.1506 -0.1753 -0.0582 0.1891 0.1403 0.1300 0.1626 0.1531 0.1602 0.1686
va: 3.8235 0.9915 3.8456 0.9837 3.7443 3.7290 3.8724 0.9888 0.9833 3.8461 0.9865 0.9815 3.8446 3.7148 0.9760 0.9919 0.9919 0.9974 0.9814 0.9766 0.9929
dispcorr: -0.034861390 hartree
energy: -312.287687888717
dipole: 0.55338 -0.69271 -0.13933 1.83671 -1.92853 -0.09182 0.22929 -0.39586 -0.16657
magnitude: 0.23577 au
magnitude: 0.59929 debye
