program: Orca
programVersion: 5.0.3
elementType: C H C H C C C H H C H H C C H H H H H H H
charge: 1
multiplicity: 1
keywords: DSD-PBEP86/2013 def2-TZVP D3BJ RIJCOSX verytightscf def2-TZVP/C def2/J soscf noTRAH
formula: C8H13
InChI: InChI=1/C8H13/c1-2-4-6-8-7-5-3-1/h1-2,7H,3-6,8H2
21 atoms
C  -2.000402 0.665286 0.075265
H  -2.177089 0.790622 1.149009
C  -1.77105 -0.957061 -0.172032
H  -2.633378 -1.414958 0.321049
C  -0.414501 -1.356275 0.373214
C  0.668615 -1.262974 -0.410689
C  1.97453 -0.707507 0.068626
H  2.164633 -0.936558 1.12232
H  2.838866 -1.035896 -0.517959
C  1.80338 0.833374 -0.11873
H  1.837859 1.093353 -1.182621
H  2.616931 1.374363 0.372139
C  0.447325 1.360198 0.501511
C  -0.738475 1.250513 -0.333259
H  0.517028 -1.206496 -1.492595
H  -1.840151 -1.141676 -1.247374
H  0.27709 0.958173 1.502179
H  -0.646444 1.609744 -1.363284
H  -2.856904 0.989405 -0.519808
H  0.585134 2.460618 0.595653
H  -0.313847 -1.425008 1.456419
totalener: -311.13880900 hartree
nucrepener: 379.31530086 hartree
electener: -690.45410986 hartree
oneelecener: -1159.08859225 hartree
twoeener: 468.63448239 hartree
kineticenergy: 310.01277418 hartree
exchangeener: -14.122176273532 hartree
correlationener: -0.942853998759 hartree
xcener: -15.065030272291 hartree
chargesum: 1.0000000
charge: -0.234263 0.186831 -0.213956 0.182301 -0.190031 -0.130522 -0.207252 0.153623 0.163744 -0.261364 0.153382 0.172253 -0.153412 0.119322 0.143774 0.176687 0.162186 0.218763 0.187761 0.205172 0.165001
charge: -0.179075 0.168588 -0.157989 0.153286 -0.155208 -0.143142 -0.219331 0.149283 0.151100 -0.193870 0.143821 0.150566 -0.203904 0.185164 0.151179 0.151753 0.161185 0.176483 0.160156 0.201069 0.148886
qa: -0.2343 0.1868 -0.2140 0.1823 -0.1900 -0.1305 -0.2073 0.1536 0.1637 -0.2614 0.1534 0.1723 -0.1534 0.1193 0.1438 0.1767 0.1622 0.2188 0.1878 0.2052 0.1650
va: 3.8617 0.9621 3.8488 0.9641 3.8677 3.8453 3.8798 0.9731 0.9722 3.8963 0.9683 0.9635 3.8274 3.4928 0.9679 0.9649 0.9816 0.9377 0.9666 0.9524 0.9654
total: -311.789964578 hartree
dispcorr: -0.014127112 hartree
energy: -311.804091689182
dipole: 0.34627 -1.08256 -0.73630 1.98072 -0.54340 1.43732 0.18269 -0.36494 -0.18225
magnitude: 1.62519 au
magnitude: 4.13089 debye
