program: Orca
programVersion: 5.0.3
elementType: C H C H C C C H H C H H C C H H H H H H H
charge: 1
multiplicity: 1
keywords: b3lyp def2-TZVP EnGrad RIJCOSX verytightscf def2/J soscf
formula: C8H13
InChI: InChI=1/C8H13/c1-2-4-6-8-7-5-3-1/h1-2,7H,3-6,8H2
21 atoms
C  -1.992145 0.594858 0.086654
H  -2.169817 0.767721 1.15442
C  -1.824091 -0.957262 -0.172548
H  -2.649435 -1.483708 0.315425
C  -0.438737 -1.310247 0.353166
C  0.652091 -1.240618 -0.437149
C  1.947656 -0.698307 0.072268
H  2.116063 -0.943346 1.126022
H  2.815366 -1.03504 -0.505152
C  1.822499 0.849781 -0.102607
H  1.864576 1.108581 -1.166831
H  2.65496 1.363283 0.386721
C  0.48087 1.415081 0.509808
C  -0.688948 1.174377 -0.322497
H  0.524977 -1.261155 -1.521682
H  -1.882465 -1.152738 -1.248133
H  0.331212 1.084936 1.540414
H  -0.594307 1.479776 -1.369577
H  -2.823026 0.994399 -0.503798
H  0.62169 2.515854 0.512401
H  -0.318097 -1.347959 1.436846
totalener: -312.22976333 hartree
nucrepener: 380.20069652 hartree
electener: -692.43045985 hartree
oneelecener: -1161.46499578 hartree
twoeener: 469.03453594 hartree
kineticenergy: 310.52483974 hartree
exchangeener: -36.322518682341 hartree
correlationener: -2.303961080795 hartree
xcener: -38.626479763136 hartree
chargesum: 1.0000000
charge: -0.183725 0.164065 -0.199259 0.164723 -0.125995 -0.086889 -0.206994 0.148370 0.159232 -0.228523 0.146699 0.162957 -0.120999 0.042493 0.147622 0.155596 0.149086 0.198881 0.169373 0.189577 0.153711
charge: -0.195013 0.165414 -0.190354 0.152970 -0.101709 -0.124679 -0.217065 0.153099 0.159702 -0.192022 0.148090 0.153688 -0.210764 0.137577 0.156372 0.154849 0.159694 0.171936 0.163207 0.200840 0.154169
qa: -0.1837 0.1641 -0.1993 0.1647 -0.1260 -0.0869 -0.2070 0.1484 0.1592 -0.2285 0.1467 0.1630 -0.1210 0.0425 0.1476 0.1556 0.1491 0.1989 0.1694 0.1896 0.1537
va: 3.8361 0.9665 3.8313 0.9682 3.8389 3.8014 3.8861 0.9697 0.9703 3.8609 0.9675 0.9639 3.8164 3.5821 0.9674 0.9711 0.9796 0.9454 0.9684 0.9569 0.9664
energy: -312.229763329975
dipole: 0.46068 -0.89002 -0.42934 1.95718 -0.91182 1.04536 0.14699 -0.26910 -0.12211
magnitude: 1.13667 au
magnitude: 2.88918 debye
