program: Gaussian 09
title: 000051146
version: EM64L-G09RevD.01
frameworkgroup: C1[X(C12H26O2)]
method: RPBEPBE
basis: SDD
operation: Freq
keyword: #pfreq=noraman
keyword: PBEPBE/SDD
title: #p freq=noraman PBEPBE/SDD
converged: NO YES NO NO
title: Mulliken charges:
elementType: O O C C C C C C C C C C C C H H H H H H H H H H H H H H H H H H H H H H H H H H
charge: -0.344882 -0.449816 0.464328 -0.450022 -0.503296 -0.452310 -0.380977 -0.389890 -0.379799 -0.267913 -0.696886 -0.695003 -0.702823 -0.331960 0.190244 0.206330 0.212110 0.223344 0.208226 0.194690 0.206399 0.225008 0.208590 0.207606 0.208964 0.223979 0.207663 0.188070 0.205920 0.209080 0.221289 0.212410 0.212073 0.216895 0.206506 0.209562 0.219564 0.197965 0.206535 0.352226
chargesum: 0.00000
title: Mulliken charges with hydrogens summed into heavy atoms:
elementType: O O C C C C C C C C C C C C
charge: -0.344882 -0.097590 0.464328 -0.053448 -0.067841 -0.049394 0.050430 0.026306 0.053144 0.127819 -0.060597 -0.053624 -0.067192 0.072540
polarizability: 1.47150557e+02 -7.31583646e-01 1.46469911e+02 -1.68061734e+00 1.78328430e+00 1.20578109e+02
1716.lowfreq: -19.3402 -13.0765 -0.0001 0.0004 0.0006 3.4289 39.8460 44.5419 56.5344
frequency: 39.6994 44.3985 56.0743 61.2118 67.6926 68.5200 86.2503 95.4583 117.0322 140.4565 188.4187 212.9412 214.1139 231.1261 234.7301 243.1486 283.5542 300.8902 315.3088 320.3941 329.8363 352.2073 406.9257 486.6266 501.2102 563.1700 602.2235 728.6890 735.6563 742.0638 759.6411 808.3169 832.6546 865.0521 874.7807 878.9950 886.7866 914.3972 922.8303 947.6158 989.5036 995.6897 1031.1659 1044.1730 1049.8692 1054.9277 1073.5123 1087.9860 1093.1840 1097.1877 1117.2587 1146.3874 1166.7826 1185.7180 1201.0687 1211.3146 1225.6897 1241.4183 1253.8790 1278.9662 1283.6601 1288.6155 1294.5942 1306.1475 1314.3249 1328.5485 1346.5913 1353.6857 1359.2103 1360.1244 1383.5437 1389.7989 1389.9787 1390.3839 1457.7004 1461.6335 1464.7141 1469.8770 1473.5672 1474.2632 1475.8037 1476.6246 1476.9555 1477.1059 1480.0078 1486.2360 1487.6204 1491.8471 2949.3303 2961.1343 2965.3619 2968.1052 2969.6230 2970.5976 2972.6222 2974.0580 2981.9642 2985.3341 2995.0084 3003.3630 3011.9037 3014.9310 3015.2485 3034.3527 3037.5625 3048.9525 3066.9810 3068.0543 3070.6161 3071.8149 3072.2836 3073.2085 3078.1412 3516.2164
redmass: 3.5025 2.7715 3.2744 3.1181 1.8774 1.7769 2.5858 1.9398 2.9514 2.7452 1.9795 1.4051 1.4927 1.6356 1.5277 1.7629 2.7193 2.8110 2.9864 2.5963 2.5133 3.3514 2.6249 2.5225 1.1873 2.2589 2.9216 1.2490 1.5446 1.1355 1.6390 2.2110 1.3820 1.6364 2.6341 1.6553 1.4235 1.7023 1.8601 1.7997 1.5428 2.8247 2.9985 3.4685 2.6100 2.5892 1.4974 1.7216 1.9074 2.0316 2.3184 2.3850 2.0383 1.2688 1.4183 1.7341 1.3470 1.2798 1.3968 1.1275 1.2811 1.2716 1.2045 1.3314 1.3259 1.2135 1.3893 1.6245 1.5733 1.4962 1.2413 1.2100 1.2160 1.2146 1.0800 1.0765 1.0906 1.0633 1.0640 1.0502 1.0488 1.0441 1.0612 1.0474 1.0501 1.0837 1.0792 1.0888 1.0558 1.0604 1.0688 1.0504 1.0390 1.0456 1.0485 1.0446 1.0603 1.0602 1.0608 1.0971 1.0962 1.1027 1.0986 1.1012 1.1009 1.1013 1.1012 1.1013 1.0991 1.1007 1.0992 1.0994 1.0969 1.0647
irintensity: 1.8043 0.5429 0.5025 0.2115 0.4957 0.2743 0.2847 0.0954 1.5652 2.8548 7.2802 0.6208 0.2018 0.0737 4.1682 0.1272 0.2128 0.8130 0.1553 0.8185 6.9526 1.3569 4.1947 9.5937 212.9849 9.8152 1.4749 1.4818 5.2584 8.7792 11.8557 3.6443 1.3539 4.2461 23.3450 10.9539 1.9712 13.2117 20.6147 14.8301 3.3333 92.4008 5.2539 51.9566 0.2327 0.2762 1.7722 3.5198 9.8880 4.4267 1.2400 38.9585 13.3577 7.5921 5.4833 14.1482 0.5825 0.2831 4.7335 0.2843 6.3849 5.2318 1.4290 11.3811 12.0378 16.6804 1.0905 7.4127 4.0018 0.2820 30.5833 14.0202 7.6765 7.4200 9.1142 6.0098 0.9826 0.7305 7.0719 3.9688 11.2843 1.7882 6.9717 19.7123 11.4565 6.6314 39.1665 1.0453 26.5280 4.3728 53.5241 7.4038 41.7579 9.6243 92.8607 12.3409 17.9727 51.0314 51.7066 0.7845 30.1917 67.2269 1.7672 5.3065 23.6210 21.9224 5.7096 157.6556 36.0389 68.9065 74.6946 54.4709 42.3712 8.9494
temp: 298.150 k
press: 1.00000 atm
elementType: 8 8 6 6 6 6 6 6 6 6 6 6 6 6 1 1 1 1 1 1 1 1 1 1 1 1 1 1 1 1 1 1 1 1 1 1 1 1 1 1
symmnumber: 1
zpe: 947004.0 jmol-1
zpe.correction: 0.360695 hartree
zpe.thermalcorrener: 0.379602 hartree
zpe.thermalcorrenthalpy: 0.380546 hartree
zpe.thermalcorrgfe: 0.312847 hartree
zpe.sumelectzpe: -622.107902 hartree
zpe.sumelectthermal: -622.088994 hartree
zpe.sumelectthermalent: -622.088050 hartree
zpe.sumelectthermalfe: -622.155749 hartree
dipole: -2.5044 -0.0904 -1.8844
dipole: 3.1355
quadrupole: -101.1053 -85.7953 -92.5023
quadrupole: -0.7965 -5.9736 2.2080
quadrupole: -7.9710 7.3390 0.6320 -0.7965 -5.9736 2.2080
hfenergy: -622.4685966 hartree
pointgroup: C01 [X(C12H26O2)]
dipole: -0.9744259 0.2221851 0.72312 debye
polarizability: 147.2938957|0.3741049|146.0512283|2.796018|2.3404877|120.8534531 unknown
InChI: InChI=1S/C12H26O2/c1-4-7-12(8-5-2,9-6-3)14-11-10-13/h13H,4-11H2,1-3H3
charge 0 multiplicity 1
40 atoms
O  0.874209 0.581457 -0.534343
O  3.471958 0.187296 -1.403543
C  -0.28939 -0.010841 0.210997
C  0.187066 -1.14663 1.162661
C  -1.164089 -0.533604 -0.957464
C  -0.994459 1.096738 1.044754
C  1.041881 -2.260416 0.519127
C  -2.491149 -1.215286 -0.555465
C  -1.51831 2.308425 0.242351
C  1.95029 1.2067 0.24817
C  1.520276 -3.296535 1.55979
C  -3.304297 -1.66004 -1.791089
C  -1.992375 3.45485 1.161443
C  3.073341 1.446644 -0.767753
H  0.756738 -0.69896 2.003618
H  -0.712102 -1.599062 1.627474
H  -0.55647 -1.240653 -1.554268
H  -1.377169 0.320153 -1.628036
H  -1.830693 0.634294 1.607134
H  -0.283971 1.45834 1.817188
H  0.458967 -2.778885 -0.267092
H  1.919313 -1.81041 0.015675
H  -3.105904 -0.523372 0.054062
H  -2.288265 -2.099568 0.080741
H  -2.356708 1.995107 -0.410133
H  -0.718345 2.669294 -0.433041
H  2.304556 0.528823 1.050589
H  1.620461 2.165823 0.700503
H  0.664059 -3.784201 2.063848
H  2.140881 -2.818197 2.341203
H  2.129395 -4.088174 1.086572
H  -2.726441 -2.37169 -2.410446
H  -3.561001 -0.794234 -2.430073
H  -4.247762 -2.155648 -1.49747
H  -1.163965 3.825937 1.794612
H  -2.802375 3.118259 1.836406
H  -2.376433 4.309336 0.574593
H  2.73267 2.180966 -1.527987
H  3.974899 1.837405 -0.266344
H  2.624216 -0.24194 -1.696164
