program: Orca
programVersion: 5.0.3
elementType: C H C H C C C H H C H H C C H H H H H H H
charge: 1
multiplicity: 1
keywords: DSD-PBEP86 cc-pVTZ EnGrad RIJCOSX verytightscf cc-pVTZ/C def2/J soscf
formula: C8H13
InChI: InChI=1/C8H13/c1-2-4-6-8-7-5-3-1/h1-2,7H,3-6,8H2
21 atoms
C  -2.006342 0.696513 0.088695
H  -2.217558 0.878759 1.146578
C  -1.791339 -0.920639 -0.138508
H  -2.625917 -1.408597 0.368296
C  -0.436944 -1.339212 0.410448
C  0.698936 -1.279955 -0.361726
C  2.010422 -0.684096 0.078725
H  2.224485 -0.882339 1.133567
H  2.857425 -1.01475 -0.525267
C  1.80882 0.911059 -0.138895
H  1.872525 1.13569 -1.208513
H  2.625999 1.427988 0.367371
C  0.433965 1.299085 0.416659
C  -0.71675 1.307741 -0.357984
H  0.531447 -1.202853 -1.440463
H  -1.865782 -1.130927 -1.20969
H  0.015839 0.049279 0.366578
H  -0.564058 1.276896 -1.441024
H  -2.862346 1.004668 -0.51362
H  0.343687 1.453575 1.495649
H  -0.345059 -1.475797 1.490297
totalener: -311.09583396 hartree
nucrepener: 382.47480231 hartree
electener: -693.57063627 hartree
oneelecener: -1164.89871126 hartree
twoeener: 471.32807499 hartree
kineticenergy: 309.65454245 hartree
exchangeener: -12.747964479863 hartree
correlationener: -0.948823436300 hartree
xcener: -13.696787916163 hartree
chargesum: 1.0000000
charge: -0.251981 0.177103 -0.278494 0.189026 -0.080835 -0.055153 -0.249540 0.172619 0.187471 -0.271891 0.171706 0.187595 -0.086029 -0.030449 0.181902 0.174350 0.080044 0.189855 0.190736 0.202269 0.199696
charge: 0.106787 -0.001399 0.115733 0.001757 0.102240 0.150749 0.100357 -0.002471 0.002049 0.115221 -0.004729 0.000818 0.117582 0.183242 0.000224 -0.004649 -0.006081 0.005011 0.003519 0.011989 0.002052
qa: -0.2520 0.1771 -0.2785 0.1890 -0.0808 -0.0552 -0.2495 0.1726 0.1875 -0.2719 0.1717 0.1876 -0.0860 -0.0304 0.1819 0.1743 0.0800 0.1899 0.1907 0.2023 0.1997
va: 3.8847 0.9800 3.9309 0.9727 3.7897 3.8143 3.8876 0.9817 0.9719 3.9262 0.9818 0.9743 3.7869 3.7850 0.9812 0.9804 1.1312 0.9778 0.9716 0.9782 0.9775
energy: -311.812609846548
dipole: -0.00872 -0.07630 -0.08502 0.10488 0.03847 0.14335 0.02804 -0.04385 -0.01581
magnitude: 0.16742 au
magnitude: 0.42554 debye
