program: Orca
programVersion: 5.0.3
elementType: C H C H C C C H H C H H C C H H H H H H H
charge: 1
multiplicity: 1
keywords: b3lyp def2-TZVP EnGrad D3BJ RIJCOSX verytightscf def2/J soscf
formula: C8H13
InChI: InChI=1/C8H13/c1-2-4-6-8-7-5-3-1/h1-2,7H,3-6,8H2
21 atoms
C  -1.997884 0.744732 0.075443
H  -2.184329 0.85826 1.146703
C  -1.743302 -0.944291 -0.148765
H  -2.618399 -1.331529 0.378404
C  -0.425246 -1.373119 0.401464
C  0.692812 -1.283492 -0.368014
C  2.005957 -0.687641 0.066394
H  2.218095 -0.878284 1.12419
H  2.858325 -1.027563 -0.52679
C  1.796591 0.884304 -0.145112
H  1.852086 1.129984 -1.210912
H  2.605875 1.42136 0.354894
C  0.422335 1.254802 0.460988
C  -0.759178 1.31608 -0.378543
H  0.528896 -1.21341 -1.447933
H  -1.842899 -1.12286 -1.220422
H  0.131621 0.350442 1.026128
H  -0.637352 1.445318 -1.457736
H  -2.874207 0.98474 -0.526579
H  0.402675 1.956511 1.312614
H  -0.34524 -1.509506 1.481246
totalener: -312.19396661 hartree
nucrepener: 380.41692819 hartree
electener: -692.61089480 hartree
oneelecener: -1161.80334705 hartree
twoeener: 469.19245225 hartree
kineticenergy: 310.52445800 hartree
exchangeener: -36.316148346276 hartree
correlationener: -2.305105854812 hartree
xcener: -38.621254201088 hartree
chargesum: 1.0000000
charge: -0.216894 0.179233 -0.233698 0.184379 -0.134013 -0.070693 -0.205919 0.149447 0.157696 -0.275746 0.153215 0.161023 -0.076312 0.059176 0.132279 0.175330 0.107542 0.188100 0.183197 0.212441 0.170216
charge: -0.166879 0.165475 -0.139137 0.164556 -0.189762 -0.097429 -0.211934 0.150871 0.150619 -0.200092 0.145801 0.154008 -0.210012 0.081616 0.153577 0.154930 0.215682 0.168362 0.161916 0.194294 0.153538
qa: -0.2169 0.1792 -0.2337 0.1844 -0.1340 -0.0707 -0.2059 0.1494 0.1577 -0.2757 0.1532 0.1610 -0.0763 0.0592 0.1323 0.1753 0.1075 0.1881 0.1832 0.2124 0.1702
va: 3.8380 0.9629 3.8710 0.9572 3.7559 3.8419 3.8404 0.9690 0.9723 3.9080 0.9649 0.9700 3.6549 3.6571 0.9675 0.9605 1.0463 0.9542 0.9646 0.9482 0.9619
dispcorr: -0.037044462 hartree
energy: -312.231011074576
dipole: 0.08917 -0.81392 -0.72475 0.99688 -0.14132 0.85556 0.40664 -0.45851 -0.05187
magnitude: 1.12246 au
magnitude: 2.85307 debye
