program: Orca
programVersion: 5.0.3
elementType: C H C H C C C H H C H H C C H H H H H H H
charge: 1
multiplicity: 1
keywords: m062x cc-pVTZ EnGrad RIJCOSX verytightscf cc-pVTZ/C def2/J soscf
formula: C8H13
InChI: InChI=1/C8H13/c1-2-4-6-8-7-5-3-1/h1-2,7H,3-6,8H2
21 atoms
C  -1.998823 0.759882 0.070097
H  -2.162407 0.831319 1.148069
C  -1.730077 -0.966628 -0.158198
H  -2.618389 -1.317776 0.371101
C  -0.416526 -1.386741 0.393002
C  0.68618 -1.27636 -0.377526
C  2.001413 -0.69183 0.062897
H  2.209523 -0.889387 1.120035
H  2.855864 -1.034151 -0.526869
C  1.78916 0.858004 -0.140365
H  1.830832 1.118468 -1.203623
H  2.59301 1.406508 0.357579
C  0.421924 1.261533 0.488959
C  -0.767777 1.301036 -0.373424
H  0.521648 -1.20174 -1.457183
H  -1.834153 -1.126926 -1.231714
H  0.188852 0.58111 1.313954
H  -0.659063 1.588678 -1.422817
H  -2.882524 0.991684 -0.522719
H  0.468109 2.247142 0.997338
H  -0.335232 -1.487251 1.474839
totalener: -312.26627159 hartree
nucrepener: 379.49341122 hartree
electener: -691.75968281 hartree
oneelecener: -1159.74181753 hartree
twoeener: 467.98213473 hartree
kineticenergy: 310.02982512 hartree
xcener: -23.083047513399 hartree
chargesum: 1.0000000
charge: -0.325769 0.225816 -0.285196 0.208279 -0.151278 -0.126546 -0.294712 0.178587 0.183452 -0.295854 0.183281 0.186735 -0.266847 0.109253 0.187357 0.210180 0.167547 0.256521 0.207739 0.237517 0.203938
charge: 0.129140 0.014155 0.174346 0.007579 0.017652 0.067656 0.074375 -0.003454 -0.002396 0.104221 -0.011140 -0.000333 0.074589 0.310915 -0.015738 -0.000085 0.008092 0.019786 0.006247 0.044625 -0.020233
qa: -0.3258 0.2258 -0.2852 0.2083 -0.1513 -0.1265 -0.2947 0.1786 0.1835 -0.2959 0.1833 0.1867 -0.2668 0.1093 0.1874 0.2102 0.1675 0.2565 0.2077 0.2375 0.2039
va: 3.7436 0.9407 3.7718 0.9481 3.6209 3.6552 3.7774 0.9616 0.9598 3.7319 0.9566 0.9564 3.7296 3.3571 0.9568 0.9468 0.9802 0.9284 0.9570 0.9371 0.9539
energy: -312.266271588717
dipole: 0.16485 -1.04921 -0.88436 1.59914 -0.47179 1.12735 0.39145 -0.51931 -0.12786
magnitude: 1.43853 au
magnitude: 3.65646 debye
