program: Orca
programVersion: 5.0.3
elementType: C H C H C C C H H C H H C C H H H H H H H
charge: 1
multiplicity: 1
keywords: m062x cc-pVTZ EnGrad RIJCOSX verytightscf cc-pVTZ/C def2/J soscf
formula: C8H13
InChI: InChI=1/C8H13/c1-2-4-6-8-7-5-3-1/h1-2,7H,3-6,8H2
21 atoms
C  -2.002287 0.748589 0.069263
H  -2.165995 0.812579 1.147735
C  -1.731773 -0.975169 -0.165306
H  -2.619813 -1.337002 0.357393
C  -0.411445 -1.385725 0.387881
C  0.681712 -1.271167 -0.387058
C  1.996368 -0.699275 0.062917
H  2.199941 -0.908185 1.118588
H  2.853174 -1.036974 -0.526831
C  1.788007 0.84059 -0.133147
H  1.821748 1.104525 -1.196024
H  2.593044 1.391331 0.360572
C  0.425747 1.289644 0.496447
C  -0.765642 1.290842 -0.358668
H  0.516923 -1.190542 -1.466208
H  -1.829139 -1.135363 -1.239803
H  0.219422 0.741716 1.419163
H  -0.658899 1.633695 -1.391646
H  -2.881602 0.99802 -0.523273
H  0.51051 2.35537 0.805363
H  -0.325572 -1.472508 1.470219
totalener: -312.27216125 hartree
nucrepener: 379.16040477 hartree
electener: -691.43256602 hartree
oneelecener: -1159.09532316 hartree
twoeener: 467.66275715 hartree
kineticenergy: 310.03288432 hartree
xcener: -23.082712794524 hartree
chargesum: 1.0000000
charge: -0.330191 0.227016 -0.281292 0.206968 -0.160600 -0.124336 -0.298153 0.180716 0.183809 -0.287957 0.182205 0.187456 -0.273756 0.107400 0.185780 0.208773 0.178363 0.261541 0.205732 0.233526 0.207000
charge: 0.129298 0.014221 0.173759 0.005833 0.019873 0.061176 0.071225 -0.002594 -0.001038 0.104622 -0.009860 0.000171 0.077397 0.309702 -0.015690 -0.000649 0.007002 0.021948 0.005791 0.048811 -0.020997
qa: -0.3302 0.2270 -0.2813 0.2070 -0.1606 -0.1243 -0.2982 0.1807 0.1838 -0.2880 0.1822 0.1875 -0.2738 0.1074 0.1858 0.2088 0.1784 0.2615 0.2057 0.2335 0.2070
va: 3.7449 0.9407 3.7674 0.9488 3.6158 3.6553 3.7765 0.9612 0.9600 3.7289 0.9564 0.9547 3.7463 3.3522 0.9575 0.9476 0.9732 0.9247 0.9592 0.9404 0.9527
energy: -312.272161250430
dipole: 0.21888 -1.07466 -0.85578 1.83229 -0.62865 1.20363 0.31390 -0.45683 -0.14293
magnitude: 1.48375 au
magnitude: 3.77140 debye
