program: Orca
programVersion: 5.0.3
elementType: C H C H C C C H H C H H C C H H H H H H H
charge: 1
multiplicity: 1
keywords: b3lyp def2-TZVP EnGrad RIJCOSX verytightscf def2/J soscf
formula: C8H13
InChI: InChI=1/C8H13/c1-2-4-6-8-7-5-3-1/h1-2,7H,3-6,8H2
21 atoms
C  -1.988532 0.663241 0.110941
H  -2.168471 0.854789 1.173318
C  -1.835891 -0.938783 -0.127519
H  -2.647463 -1.438467 0.404418
C  -0.460823 -1.338623 0.387067
C  0.682251 -1.267434 -0.373005
C  1.9903 -0.663297 0.099357
H  2.174522 -0.864584 1.159207
H  2.847697 -1.011216 -0.479604
C  1.837088 0.939035 -0.125473
H  1.934257 1.161892 -1.192754
H  2.647828 1.436986 0.409406
C  0.460952 1.329959 0.395301
C  -0.685187 1.275282 -0.361827
H  0.544876 -1.258348 -1.457886
H  -1.935697 -1.15181 -1.196538
H  0.001485 0.000414 0.069903
H  -0.553743 1.284371 -1.447328
H  -2.849771 1.013061 -0.461097
H  0.348686 1.328201 1.482457
H  -0.346488 -1.354411 1.473981
totalener: -312.18747915 hartree
nucrepener: 382.88822139 hartree
electener: -695.07570054 hartree
oneelecener: -1166.31398647 hartree
twoeener: 471.23828593 hartree
kineticenergy: 310.50188616 hartree
exchangeener: -36.318834580458 hartree
correlationener: -2.309233024003 hartree
xcener: -38.628067604461 hartree
chargesum: 1.0000000
charge: -0.218462 0.157022 -0.229646 0.171866 -0.077567 -0.049806 -0.219091 0.156833 0.170568 -0.230519 0.157841 0.171808 -0.075699 -0.051220 0.155891 0.158035 0.200353 0.156102 0.170637 0.162578 0.162476
charge: -0.195224 0.153189 -0.194320 0.156948 -0.120285 -0.098116 -0.195358 0.153076 0.156972 -0.194430 0.152917 0.156845 -0.121485 -0.096578 0.164132 0.153001 0.319850 0.163990 0.157061 0.164018 0.163796
qa: -0.2185 0.1570 -0.2296 0.1719 -0.0776 -0.0498 -0.2191 0.1568 0.1706 -0.2305 0.1578 0.1718 -0.0757 -0.0512 0.1559 0.1580 0.2004 0.1561 0.1706 0.1626 0.1625
va: 3.8720 0.9684 3.8869 0.9673 3.7848 3.8021 3.8735 0.9684 0.9673 3.8885 0.9681 0.9673 3.7789 3.8080 0.9638 0.9681 0.9704 0.9636 0.9672 0.9633 0.9632
energy: -312.187479148295
dipole: -0.00210 -0.00207 -0.00417 0.00156 -0.00004 0.00152 -0.05811 0.04769 -0.01042
magnitude: 0.01132 au
magnitude: 0.02878 debye
