program: Orca
programVersion: 5.0.3
charge: 1
multiplicity: 1
keywords: DLPNO-CCSD(T1) tightPNO Extrapolate(3/4,def2) RIJK def2/JK verytightSCF miniprint nopop
formula: C8H13
InChI: InChI=1/C8H13/c1-2-4-6-8-7-5-3-1/h1-2,7H,3-6,8H2
21 atoms
C  -1.997427 0.530175 0.119988
H  -2.175172 0.722971 1.181514
C  -1.954241 -0.996803 -0.170454
H  -2.675724 -1.589381 0.394366
C  -0.517017 -1.142136 0.282753
C  0.610695 -1.125062 -0.503295
C  1.907451 -0.652386 0.065141
H  2.008244 -0.952295 1.113617
H  2.762947 -1.044646 -0.491417
C  1.893823 0.912461 -0.036545
H  2.018285 1.204706 -1.085886
H  2.74157 1.327974 0.514583
C  0.556779 1.481499 0.490676
C  -0.549944 0.829118 -0.264756
H  0.530958 -1.30084 -1.575655
H  -2.068496 -1.205737 -1.238231
H  0.439955 1.357449 1.572137
H  -0.423218 0.892045 -1.348485
H  -2.71797 1.097253 -0.478061
H  0.525787 2.562603 0.278786
H  -0.367182 -1.091157 1.362491
e0: -310.324678228 hartree
corrType: DLPNO BASED
e0: -310.338270010 hartree
basis: def2-TZVPP def2-QZVPP
scfener: -310.324678228 -310.338270010
corrmethod: MDCI MDCI
correner: -1.452111208 -1.522261732
corrcbsextra: -1.574225044
energy: -311.914367168591
dipole: 0.56226 -0.79639 -0.23413 1.85430 -1.69279 0.16151 0.18704 -0.38932 -0.20228
magnitude: 0.34903 au
magnitude: 0.88716 debye
