program: Orca
programVersion: 5.0.3
elementType: C H C H C C C H H C H H C C H H H H H H H
charge: 1
multiplicity: 1
keywords: PBE0 def2-TZVP EnGrad D3BJ RIJCOSX verytightscf def2/J soscf
formula: C8H13
InChI: InChI=1/C8H13/c1-2-4-6-8-7-5-3-1/h1-2,7H,3-6,8H2
21 atoms
C  -2.000402 0.665286 0.075265
H  -2.177089 0.790622 1.149009
C  -1.77105 -0.957061 -0.172032
H  -2.633378 -1.414958 0.321049
C  -0.414501 -1.356275 0.373214
C  0.668615 -1.262974 -0.410689
C  1.97453 -0.707507 0.068626
H  2.164633 -0.936558 1.12232
H  2.838866 -1.035896 -0.517959
C  1.80338 0.833374 -0.11873
H  1.837859 1.093353 -1.182621
H  2.616931 1.374363 0.372139
C  0.447325 1.360198 0.501511
C  -0.738475 1.250513 -0.333259
H  0.517028 -1.206496 -1.492595
H  -1.840151 -1.141676 -1.247374
H  0.27709 0.958173 1.502179
H  -0.646444 1.609744 -1.363284
H  -2.856904 0.989405 -0.519808
H  0.585134 2.460618 0.595653
H  -0.313847 -1.425008 1.456419
totalener: -312.04721038 hartree
nucrepener: 379.31530086 hartree
electener: -691.36251124 hartree
oneelecener: -1159.70108232 hartree
twoeener: 468.33857108 hartree
kineticenergy: 310.15405693 hartree
exchangeener: -34.167514093199 hartree
correlationener: -1.961039499572 hartree
xcener: -36.128553592771 hartree
chargesum: 1.0000000
charge: -0.212757 0.187589 -0.219197 0.182753 -0.180295 -0.113974 -0.213221 0.157856 0.167410 -0.264223 0.160631 0.174888 -0.146063 0.064584 0.141214 0.179204 0.165613 0.208885 0.187685 0.209042 0.162373
charge: -0.182970 0.174907 -0.164577 0.159198 -0.153012 -0.145840 -0.226650 0.155659 0.159477 -0.199312 0.151195 0.157291 -0.208499 0.133410 0.156662 0.157892 0.166664 0.176890 0.166068 0.212268 0.153278
qa: -0.2128 0.1876 -0.2192 0.1828 -0.1803 -0.1140 -0.2132 0.1579 0.1674 -0.2642 0.1606 0.1749 -0.1461 0.0646 0.1412 0.1792 0.1656 0.2089 0.1877 0.2090 0.1624
va: 3.9057 0.9623 3.8902 0.9633 3.9361 3.9038 3.9255 0.9709 0.9710 3.9665 0.9663 0.9623 3.8854 3.6851 0.9672 0.9651 0.9802 0.9430 0.9661 0.9521 0.9649
dispcorr: -0.018852843 hartree
energy: -312.066063221538
dipole: 0.34627 -1.00096 -0.65470 1.98072 -0.65386 1.32686 0.18269 -0.30969 -0.12701
magnitude: 1.48503 au
magnitude: 3.77465 debye
